{"text_format":"2","workbook":"xlsx","n_sheets":6,"sheets":["使用手册","信誉提升汇总记录表","螺旋计划款信誉提升明细表","螺旋计划款操作总表","螺旋计划款操作效果图表","Sheet1"],"not_rendered":{"charts":2,"images":0,"macros":0,"external_links":0,"defined_names":0,"comments":1,"pivot_tables":0},"unopened":[],"bounds":{"document_bytes":16777216,"sheet_cells":100000,"run_cost":"one","rows_first":2000,"rows_last":500,"rows_between":2000,"halvings":0,"cell_chars":16384,"cell_head_chars":4096},"cells_cut":0,"cells_raw":0,"read":"whole","date_system":"1900"}

{"sheet":"使用手册","index":0,"n_rows":18,"n_cols":3,"rows_kept":18,"cut":false,"hidden":false,"merged":[[0,1,0,2],[16,1,16,2],[17,1,17,2]]}
[null,"此表使用手册（已更新）"]
[]
[null,"信誉提升汇总记录表","此表用于记录信誉提升的资料，不论是信誉提升作为的资金结算，还是作为后续问题联系相关人员的凭证，都是很方便的。"]
[]
[]
[null,"螺旋计划款信誉提升明细表","此表只需填写需要加入螺旋计划的新品货号，即可自动生成，此表的数据均从“信誉提升汇总表”筛选而来，如果这张表中无数据，则无法生成。"]
[null,null,"此表只是从“信誉提升汇总表”中，导出填写的螺旋计划款的相关信誉提升记录，并且作为“螺旋计划款操作总表”计算当前转换率，完成率等的依据。"]
[]
[null,"螺旋计划款操作总表","此表是根据新品21天的权重，配合销量的有规律提升，打造新品爆款，保证搜索流量的来源。"]
[null,null,"如想打造某款新品，需在“螺旋计划款信誉提升明细表”中，填写对应的货号，即可自动生成此表。"]
[null,null,"此表中均采用公式计算，且，均经过测试数据测试，保证公式无误，切勿随意更改表格位置。"]
[null,null,"表中字段，均有批注，实时统计，实时计算，方便实操者把握时机。"]
[]
[null,"螺旋计划款操作效果图表","此表根据“螺旋计划款操作总表”的数据，自动生成对应的图表，方便操作者一目了然的观看。"]
[]
{"$rows_left_out":4}
{"sheet":"信誉提升汇总记录表","index":1,"n_rows":11,"n_cols":13,"rows_kept":11,"cut":false,"hidden":false,"merged":[[0,0,0,12]]}
["店铺名-信誉提升记录"]
["货号","刷单日期","刷单关键词","进店方式","购买件数","刷单金额","支付方式","有无佣金","是否结算","刷单人旺旺ID","来源","联系方式","备注"]
["测试货号1-拼接撞色连衣裙","2014-07-22"," ","直接进店",1,76,"垫付","无","已结算","旺旺2014001","QQ好友","QQ:123456789"]
["测试货号1-拼接撞色连衣裙","2014-07-22","拼接撞色连衣裙","搜索进店",1,76,"垫付","无","已结算","旺旺2014002","QQ群","QQ:123456789"]
["测试货号2-波西米亚长裙","2014-07-23","波西米亚长裙","搜索进店",1,98,"垫付","无","已结算","旺旺2014003","QT频道","QQ:123456789"]
["测试货号1-拼接撞色连衣裙","2014-07-23","拼接撞色连衣裙","搜索进店",1,72,"垫付","无","已结算","旺旺2014004","QQ好友","QQ:123456789"]
["测试货号1-拼接撞色连衣裙","2014-07-23","拼接撞色连衣裙","搜索进店",2,152,"转账","无","已结算","旺旺2014005","YY频道","QQ:123456789"]
["测试货号2-波西米亚长裙","2014-07-24","波西米亚长裙","搜索进店",1,98,"垫付","无","已结算","旺旺2014006","QQ好友","QQ:123456789"]
["测试货号3-田园小清新连衣裙","2014-07-24","田园小清新连衣裙","搜索进店",1,78,"垫付","无","已结算","旺旺2014007","YY频道","QQ:123456789"]
["测试货号1-拼接撞色连衣裙","2014-07-24","拼接撞色连衣裙","搜索进店",1,76,"垫付","无","已结算","旺旺2014008","YY频道","QQ:123456789"]
["测试货号1-拼接撞色连衣裙","2014-07-24","拼接撞色连衣裙","搜索进店",1,76,"垫付","无","已结算","旺旺2014009","QT频道","QQ:123456789"]

{"sheet":"螺旋计划款信誉提升明细表","index":2,"n_rows":194,"n_cols":8,"rows_kept":194,"cut":false,"hidden":false,"merged":[[0,0,0,7],[1,0,1,1],[1,2,1,7]]}
["单个宝贝信誉提升记录明细"]
["输入需要进入螺旋计划的货号，便可自动生成这张表（货号需与信誉提升记录名单中货号相同，且存在记录）",null,"测试货号1-拼接撞色连衣裙"]
["刷单日期","货号","刷单关键词","进店方式","购买件数","刷单人旺旺ID","来源","备注"]
[{"$f":"IF(B4=\"\",\"\",INDEX(信誉提升汇总记录表!B:B,SMALL(IF(信誉提升汇总记录表!$A:$A=$C$2,ROW($B:$B),36500),ROW(A1))))","v":"2014-07-22"},{"$f":"INDEX(信誉提升汇总记录表!A:A,SMALL(IF(信誉提升汇总记录表!$A:$A=$C$2,ROW($B:$B),36500),ROW(B1)))&\"\"","v":"测试货号1-拼接撞色连衣裙"},{"$f":"INDEX(信誉提升汇总记录表!C:C,SMALL(IF(信誉提升汇总记录表!$A:$A=$C$2,ROW($B:$B),36500),ROW(C1)))&\"\"","v":" "},{"$f":"INDEX(信誉提升汇总记录表!D:D,SMALL(IF(信誉提升汇总记录表!$A:$A=$C$2,ROW($B:$B),36500),ROW(D1)))&\"\"","v":"直接进店"},{"$f":"IF(ISERROR(VALUE(INDEX(信誉提升汇总记录表!E:E,SMALL(IF(信誉提升汇总记录表!$A:$A=$C$2,ROW($B:$B),36500),ROW(E1)))&\"\")),\"\",VALUE(INDEX(信誉提升汇总记录表!E:E,SMALL(IF(信誉提升汇总记录表!$A:$A=$C$2,ROW($B:$B),36500),ROW(E1)))&\"\"))","v":1},{"$f":"INDEX(信誉提升汇总记录表!J:J,SMALL(IF(信誉提升汇总记录表!$A:$A=$C$2,ROW($B:$B),36500),ROW(F1)))&\"\"","v":"旺旺2014001"},{"$f":"INDEX(信誉提升汇总记录表!K:K,SMALL(IF(信誉提升汇总记录表!$A:$A=$C$2,ROW($B:$B),36500),ROW(G1)))&\"\"","v":"QQ好友"},{"$f":"INDEX(信誉提升汇总记录表!M:M,SMALL(IF(信誉提升汇总记录表!$A:$A=$C$2,ROW($B:$B),36500),ROW(H1)))&\"\"","v":""}]
[{"$f":"IF(B5=\"\",\"\",INDEX(信誉提升汇总记录表!B:B,SMALL(IF(信誉提升汇总记录表!$A:$A=$C$2,ROW($B:$B),36500),ROW(A2))))","v":"2014-07-22"},{"$f":"INDEX(信誉提升汇总记录表!A:A,SMALL(IF(信誉提升汇总记录表!$A:$A=$C$2,ROW($B:$B),36500),ROW(B2)))&\"\"","v":"测试货号1-拼接撞色连衣裙"},{"$f":"INDEX(信誉提升汇总记录表!C:C,SMALL(IF(信誉提升汇总记录表!$A:$A=$C$2,ROW($B:$B),36500),ROW(C2)))&\"\"","v":"拼接撞色连衣裙"},{"$f":"INDEX(信誉提升汇总记录表!D:D,SMALL(IF(信誉提升汇总记录表!$A:$A=$C$2,ROW($B:$B),36500),ROW(D2)))&\"\"","v":"搜索进店"},{"$f":"IF(ISERROR(VALUE(INDEX(信誉提升汇总记录表!E:E,SMALL(IF(信誉提升汇总记录表!$A:$A=$C$2,ROW($B:$B),36500),ROW(E2)))&\"\")),\"\",VALUE(INDEX(信誉提升汇总记录表!E:E,SMALL(IF(信誉提升汇总记录表!$A:$A=$C$2,ROW($B:$B),36500),ROW(E2)))&\"\"))","v":1},{"$f":"INDEX(信誉提升汇总记录表!J:J,SMALL(IF(信誉提升汇总记录表!$A:$A=$C$2,ROW($B:$B),36500),ROW(F2)))&\"\"","v":"旺旺2014002"},{"$f":"INDEX(信誉提升汇总记录表!K:K,SMALL(IF(信誉提升汇总记录表!$A:$A=$C$2,ROW($B:$B),36500),ROW(G2)))&\"\"","v":"QQ群"},{"$f":"INDEX(信誉提升汇总记录表!M:M,SMALL(IF(信誉提升汇总记录表!$A:$A=$C$2,ROW($B:$B),36500),ROW(H2)))&\"\"","v":""}]
[{"$f":"IF(B6=\"\",\"\",INDEX(信誉提升汇总记录表!B:B,SMALL(IF(信誉提升汇总记录表!$A:$A=$C$2,ROW($B:$B),36500),ROW(A3))))","v":"2014-07-23"},{"$f":"INDEX(信誉提升汇总记录表!A:A,SMALL(IF(信誉提升汇总记录表!$A:$A=$C$2,ROW($B:$B),36500),ROW(B3)))&\"\"","v":"测试货号1-拼接撞色连衣裙"},{"$f":"INDEX(信誉提升汇总记录表!C:C,SMALL(IF(信誉提升汇总记录表!$A:$A=$C$2,ROW($B:$B),36500),ROW(C3)))&\"\"","v":"拼接撞色连衣裙"},{"$f":"INDEX(信誉提升汇总记录表!D:D,SMALL(IF(信誉提升汇总记录表!$A:$A=$C$2,ROW($B:$B),36500),ROW(D3)))&\"\"","v":"搜索进店"},{"$f":"IF(ISERROR(VALUE(INDEX(信誉提升汇总记录表!E:E,SMALL(IF(信誉提升汇总记录表!$A:$A=$C$2,ROW($B:$B),36500),ROW(E3)))&\"\")),\"\",VALUE(INDEX(信誉提升汇总记录表!E:E,SMALL(IF(信誉提升汇总记录表!$A:$A=$C$2,ROW($B:$B),36500),ROW(E3)))&\"\"))","v":1},{"$f":"INDEX(信誉提升汇总记录表!J:J,SMALL(IF(信誉提升汇总记录表!$A:$A=$C$2,ROW($B:$B),36500),ROW(F3)))&\"\"","v":"旺旺2014004"},{"$f":"INDEX(信誉提升汇总记录表!K:K,SMALL(IF(信誉提升汇总记录表!$A:$A=$C$2,ROW($B:$B),36500),ROW(G3)))&\"\"","v":"QQ好友"},{"$f":"INDEX(信誉提升汇总记录表!M:M,SMALL(IF(信誉提升汇总记录表!$A:$A=$C$2,ROW($B:$B),36500),ROW(H3)))&\"\"","v":""}]
[{"$f":"IF(B7=\"\",\"\",INDEX(信誉提升汇总记录表!B:B,SMALL(IF(信誉提升汇总记录表!$A:$A=$C$2,ROW($B:$B),36500),ROW(A4))))","v":"2014-07-23"},{"$f":"INDEX(信誉提升汇总记录表!A:A,SMALL(IF(信誉提升汇总记录表!$A:$A=$C$2,ROW($B:$B),36500),ROW(B4)))&\"\"","v":"测试货号1-拼接撞色连衣裙"},{"$f":"INDEX(信誉提升汇总记录表!C:C,SMALL(IF(信誉提升汇总记录表!$A:$A=$C$2,ROW($B:$B),36500),ROW(C4)))&\"\"","v":"拼接撞色连衣裙"},{"$f":"INDEX(信誉提升汇总记录表!D:D,SMALL(IF(信誉提升汇总记录表!$A:$A=$C$2,ROW($B:$B),36500),ROW(D4)))&\"\"","v":"搜索进店"},{"$f":"IF(ISERROR(VALUE(INDEX(信誉提升汇总记录表!E:E,SMALL(IF(信誉提升汇总记录表!$A:$A=$C$2,ROW($B:$B),36500),ROW(E4)))&\"\")),\"\",VALUE(INDEX(信誉提升汇总记录表!E:E,SMALL(IF(信誉提升汇总记录表!$A:$A=$C$2,ROW($B:$B),36500),ROW(E4)))&\"\"))","v":2},{"$f":"INDEX(信誉提升汇总记录表!J:J,SMALL(IF(信誉提升汇总记录表!$A:$A=$C$2,ROW($B:$B),36500),ROW(F4)))&\"\"","v":"旺旺2014005"},{"$f":"INDEX(信誉提升汇总记录表!K:K,SMALL(IF(信誉提升汇总记录表!$A:$A=$C$2,ROW($B:$B),36500),ROW(G4)))&\"\"","v":"YY频道"},{"$f":"INDEX(信誉提升汇总记录表!M:M,SMALL(IF(信誉提升汇总记录表!$A:$A=$C$2,ROW($B:$B),36500),ROW(H4)))&\"\"","v":""}]
[{"$f":"IF(B8=\"\",\"\",INDEX(信誉提升汇总记录表!B:B,SMALL(IF(信誉提升汇总记录表!$A:$A=$C$2,ROW($B:$B),36500),ROW(A5))))","v":"2014-07-24"},{"$f":"INDEX(信誉提升汇总记录表!A:A,SMALL(IF(信誉提升汇总记录表!$A:$A=$C$2,ROW($B:$B),36500),ROW(B5)))&\"\"","v":"测试货号1-拼接撞色连衣裙"},{"$f":"INDEX(信誉提升汇总记录表!C:C,SMALL(IF(信誉提升汇总记录表!$A:$A=$C$2,ROW($B:$B),36500),ROW(C5)))&\"\"","v":"拼接撞色连衣裙"},{"$f":"INDEX(信誉提升汇总记录表!D:D,SMALL(IF(信誉提升汇总记录表!$A:$A=$C$2,ROW($B:$B),36500),ROW(D5)))&\"\"","v":"搜索进店"},{"$f":"IF(ISERROR(VALUE(INDEX(信誉提升汇总记录表!E:E,SMALL(IF(信誉提升汇总记录表!$A:$A=$C$2,ROW($B:$B),36500),ROW(E5)))&\"\")),\"\",VALUE(INDEX(信誉提升汇总记录表!E:E,SMALL(IF(信誉提升汇总记录表!$A:$A=$C$2,ROW($B:$B),36500),ROW(E5)))&\"\"))","v":1},{"$f":"INDEX(信誉提升汇总记录表!J:J,SMALL(IF(信誉提升汇总记录表!$A:$A=$C$2,ROW($B:$B),36500),ROW(F5)))&\"\"","v":"旺旺2014008"},{"$f":"INDEX(信誉提升汇总记录表!K:K,SMALL(IF(信誉提升汇总记录表!$A:$A=$C$2,ROW($B:$B),36500),ROW(G5)))&\"\"","v":"YY频道"},{"$f":"INDEX(信誉提升汇总记录表!M:M,SMALL(IF(信誉提升汇总记录表!$A:$A=$C$2,ROW($B:$B),36500),ROW(H5)))&\"\"","v":""}]
[{"$f":"IF(B9=\"\",\"\",INDEX(信誉提升汇总记录表!B:B,SMALL(IF(信誉提升汇总记录表!$A:$A=$C$2,ROW($B:$B),36500),ROW(A6))))","v":"2014-07-24"},{"$f":"INDEX(信誉提升汇总记录表!A:A,SMALL(IF(信誉提升汇总记录表!$A:$A=$C$2,ROW($B:$B),36500),ROW(B6)))&\"\"","v":"测试货号1-拼接撞色连衣裙"},{"$f":"INDEX(信誉提升汇总记录表!C:C,SMALL(IF(信誉提升汇总记录表!$A:$A=$C$2,ROW($B:$B),36500),ROW(C6)))&\"\"","v":"拼接撞色连衣裙"},{"$f":"INDEX(信誉提升汇总记录表!D:D,SMALL(IF(信誉提升汇总记录表!$A:$A=$C$2,ROW($B:$B),36500),ROW(D6)))&\"\"","v":"搜索进店"},{"$f":"IF(ISERROR(VALUE(INDEX(信誉提升汇总记录表!E:E,SMALL(IF(信誉提升汇总记录表!$A:$A=$C$2,ROW($B:$B),36500),ROW(E6)))&\"\")),\"\",VALUE(INDEX(信誉提升汇总记录表!E:E,SMALL(IF(信誉提升汇总记录表!$A:$A=$C$2,ROW($B:$B),36500),ROW(E6)))&\"\"))","v":1},{"$f":"INDEX(信誉提升汇总记录表!J:J,SMALL(IF(信誉提升汇总记录表!$A:$A=$C$2,ROW($B:$B),36500),ROW(F6)))&\"\"","v":"旺旺2014009"},{"$f":"INDEX(信誉提升汇总记录表!K:K,SMALL(IF(信誉提升汇总记录表!$A:$A=$C$2,ROW($B:$B),36500),ROW(G6)))&\"\"","v":"QT频道"},{"$f":"INDEX(信誉提升汇总记录表!M:M,SMALL(IF(信誉提升汇总记录表!$A:$A=$C$2,ROW($B:$B),36500),ROW(H6)))&\"\"","v":""}]
[{"$f":"IF(B10=\"\",\"\",INDEX(信誉提升汇总记录表!B:B,SMALL(IF(信誉提升汇总记录表!$A:$A=$C$2,ROW($B:$B),36500),ROW(A7))))","v":""},{"$f":"INDEX(信誉提升汇总记录表!A:A,SMALL(IF(信誉提升汇总记录表!$A:$A=$C$2,ROW($B:$B),36500),ROW(B7)))&\"\"","v":""},{"$f":"INDEX(信誉提升汇总记录表!C:C,SMALL(IF(信誉提升汇总记录表!$A:$A=$C$2,ROW($B:$B),36500),ROW(C7)))&\"\"","v":""},{"$f":"INDEX(信誉提升汇总记录表!D:D,SMALL(IF(信誉提升汇总记录表!$A:$A=$C$2,ROW($B:$B),36500),ROW(D7)))&\"\"","v":""},{"$f":"IF(ISERROR(VALUE(INDEX(信誉提升汇总记录表!E:E,SMALL(IF(信誉提升汇总记录表!$A:$A=$C$2,ROW($B:$B),36500),ROW(E7)))&\"\")),\"\",VALUE(INDEX(信誉提升汇总记录表!E:E,SMALL(IF(信誉提升汇总记录表!$A:$A=$C$2,ROW($B:$B),36500),ROW(E7)))&\"\"))","v":""},{"$f":"INDEX(信誉提升汇总记录表!J:J,SMALL(IF(信誉提升汇总记录表!$A:$A=$C$2,ROW($B:$B),36500),ROW(F7)))&\"\"","v":""},{"$f":"INDEX(信誉提升汇总记录表!K:K,SMALL(IF(信誉提升汇总记录表!$A:$A=$C$2,ROW($B:$B),36500),ROW(G7)))&\"\"","v":""},{"$f":"INDEX(信誉提升汇总记录表!M:M,SMALL(IF(信誉提升汇总记录表!$A:$A=$C$2,ROW($B:$B),36500),ROW(H7)))&\"\"","v":""}]
[{"$f":"IF(B11=\"\",\"\",INDEX(信誉提升汇总记录表!B:B,SMALL(IF(信誉提升汇总记录表!$A:$A=$C$2,ROW($B:$B),36500),ROW(A8))))","v":""},{"$f":"INDEX(信誉提升汇总记录表!A:A,SMALL(IF(信誉提升汇总记录表!$A:$A=$C$2,ROW($B:$B),36500),ROW(B8)))&\"\"","v":""},{"$f":"INDEX(信誉提升汇总记录表!C:C,SMALL(IF(信誉提升汇总记录表!$A:$A=$C$2,ROW($B:$B),36500),ROW(C8)))&\"\"","v":""},{"$f":"INDEX(信誉提升汇总记录表!D:D,SMALL(IF(信誉提升汇总记录表!$A:$A=$C$2,ROW($B:$B),36500),ROW(D8)))&\"\"","v":""},{"$f":"IF(ISERROR(VALUE(INDEX(信誉提升汇总记录表!E:E,SMALL(IF(信誉提升汇总记录表!$A:$A=$C$2,ROW($B:$B),36500),ROW(E8)))&\"\")),\"\",VALUE(INDEX(信誉提升汇总记录表!E:E,SMALL(IF(信誉提升汇总记录表!$A:$A=$C$2,ROW($B:$B),36500),ROW(E8)))&\"\"))","v":""},{"$f":"INDEX(信誉提升汇总记录表!J:J,SMALL(IF(信誉提升汇总记录表!$A:$A=$C$2,ROW($B:$B),36500),ROW(F8)))&\"\"","v":""},{"$f":"INDEX(信誉提升汇总记录表!K:K,SMALL(IF(信誉提升汇总记录表!$A:$A=$C$2,ROW($B:$B),36500),ROW(G8)))&\"\"","v":""},{"$f":"INDEX(信誉提升汇总记录表!M:M,SMALL(IF(信誉提升汇总记录表!$A:$A=$C$2,ROW($B:$B),36500),ROW(H8)))&\"\"","v":""}]
[{"$f":"IF(B12=\"\",\"\",INDEX(信誉提升汇总记录表!B:B,SMALL(IF(信誉提升汇总记录表!$A:$A=$C$2,ROW($B:$B),36500),ROW(A9))))","v":""},{"$f":"INDEX(信誉提升汇总记录表!A:A,SMALL(IF(信誉提升汇总记录表!$A:$A=$C$2,ROW($B:$B),36500),ROW(B9)))&\"\"","v":""},{"$f":"INDEX(信誉提升汇总记录表!C:C,SMALL(IF(信誉提升汇总记录表!$A:$A=$C$2,ROW($B:$B),36500),ROW(C9)))&\"\"","v":""},{"$f":"INDEX(信誉提升汇总记录表!D:D,SMALL(IF(信誉提升汇总记录表!$A:$A=$C$2,ROW($B:$B),36500),ROW(D9)))&\"\"","v":""},{"$f":"IF(ISERROR(VALUE(INDEX(信誉提升汇总记录表!E:E,SMALL(IF(信誉提升汇总记录表!$A:$A=$C$2,ROW($B:$B),36500),ROW(E9)))&\"\")),\"\",VALUE(INDEX(信誉提升汇总记录表!E:E,SMALL(IF(信誉提升汇总记录表!$A:$A=$C$2,ROW($B:$B),36500),ROW(E9)))&\"\"))","v":""},{"$f":"INDEX(信誉提升汇总记录表!J:J,SMALL(IF(信誉提升汇总记录表!$A:$A=$C$2,ROW($B:$B),36500),ROW(F9)))&\"\"","v":""},{"$f":"INDEX(信誉提升汇总记录表!K:K,SMALL(IF(信誉提升汇总记录表!$A:$A=$C$2,ROW($B:$B),36500),ROW(G9)))&\"\"","v":""},{"$f":"INDEX(信誉提升汇总记录表!M:M,SMALL(IF(信誉提升汇总记录表!$A:$A=$C$2,ROW($B:$B),36500),ROW(H9)))&\"\"","v":""}]
[{"$f":"IF(B13=\"\",\"\",INDEX(信誉提升汇总记录表!B:B,SMALL(IF(信誉提升汇总记录表!$A:$A=$C$2,ROW($B:$B),36500),ROW(A10))))","v":""},{"$f":"INDEX(信誉提升汇总记录表!A:A,SMALL(IF(信誉提升汇总记录表!$A:$A=$C$2,ROW($B:$B),36500),ROW(B10)))&\"\"","v":""},{"$f":"INDEX(信誉提升汇总记录表!C:C,SMALL(IF(信誉提升汇总记录表!$A:$A=$C$2,ROW($B:$B),36500),ROW(C10)))&\"\"","v":""},{"$f":"INDEX(信誉提升汇总记录表!D:D,SMALL(IF(信誉提升汇总记录表!$A:$A=$C$2,ROW($B:$B),36500),ROW(D10)))&\"\"","v":""},{"$f":"IF(ISERROR(VALUE(INDEX(信誉提升汇总记录表!E:E,SMALL(IF(信誉提升汇总记录表!$A:$A=$C$2,ROW($B:$B),36500),ROW(E10)))&\"\")),\"\",VALUE(INDEX(信誉提升汇总记录表!E:E,SMALL(IF(信誉提升汇总记录表!$A:$A=$C$2,ROW($B:$B),36500),ROW(E10)))&\"\"))","v":""},{"$f":"INDEX(信誉提升汇总记录表!J:J,SMALL(IF(信誉提升汇总记录表!$A:$A=$C$2,ROW($B:$B),36500),ROW(F10)))&\"\"","v":""},{"$f":"INDEX(信誉提升汇总记录表!K:K,SMALL(IF(信誉提升汇总记录表!$A:$A=$C$2,ROW($B:$B),36500),ROW(G10)))&\"\"","v":""},{"$f":"INDEX(信誉提升汇总记录表!M:M,SMALL(IF(信誉提升汇总记录表!$A:$A=$C$2,ROW($B:$B),36500),ROW(H10)))&\"\"","v":""}]
[{"$f":"IF(B14=\"\",\"\",INDEX(信誉提升汇总记录表!B:B,SMALL(IF(信誉提升汇总记录表!$A:$A=$C$2,ROW($B:$B),36500),ROW(A11))))","v":""},{"$f":"INDEX(信誉提升汇总记录表!A:A,SMALL(IF(信誉提升汇总记录表!$A:$A=$C$2,ROW($B:$B),36500),ROW(B11)))&\"\"","v":""},{"$f":"INDEX(信誉提升汇总记录表!C:C,SMALL(IF(信誉提升汇总记录表!$A:$A=$C$2,ROW($B:$B),36500),ROW(C11)))&\"\"","v":""},{"$f":"INDEX(信誉提升汇总记录表!D:D,SMALL(IF(信誉提升汇总记录表!$A:$A=$C$2,ROW($B:$B),36500),ROW(D11)))&\"\"","v":""},{"$f":"IF(ISERROR(VALUE(INDEX(信誉提升汇总记录表!E:E,SMALL(IF(信誉提升汇总记录表!$A:$A=$C$2,ROW($B:$B),36500),ROW(E11)))&\"\")),\"\",VALUE(INDEX(信誉提升汇总记录表!E:E,SMALL(IF(信誉提升汇总记录表!$A:$A=$C$2,ROW($B:$B),36500),ROW(E11)))&\"\"))","v":""},{"$f":"INDEX(信誉提升汇总记录表!J:J,SMALL(IF(信誉提升汇总记录表!$A:$A=$C$2,ROW($B:$B),36500),ROW(F11)))&\"\"","v":""},{"$f":"INDEX(信誉提升汇总记录表!K:K,SMALL(IF(信誉提升汇总记录表!$A:$A=$C$2,ROW($B:$B),36500),ROW(G11)))&\"\"","v":""},{"$f":"INDEX(信誉提升汇总记录表!M:M,SMALL(IF(信誉提升汇总记录表!$A:$A=$C$2,ROW($B:$B),36500),ROW(H11)))&\"\"","v":""}]
[{"$f":"IF(B15=\"\",\"\",INDEX(信誉提升汇总记录表!B:B,SMALL(IF(信誉提升汇总记录表!$A:$A=$C$2,ROW($B:$B),36500),ROW(A12))))","v":""},{"$f":"INDEX(信誉提升汇总记录表!A:A,SMALL(IF(信誉提升汇总记录表!$A:$A=$C$2,ROW($B:$B),36500),ROW(B12)))&\"\"","v":""},{"$f":"INDEX(信誉提升汇总记录表!C:C,SMALL(IF(信誉提升汇总记录表!$A:$A=$C$2,ROW($B:$B),36500),ROW(C12)))&\"\"","v":""},{"$f":"INDEX(信誉提升汇总记录表!D:D,SMALL(IF(信誉提升汇总记录表!$A:$A=$C$2,ROW($B:$B),36500),ROW(D12)))&\"\"","v":""},{"$f":"IF(ISERROR(VALUE(INDEX(信誉提升汇总记录表!E:E,SMALL(IF(信誉提升汇总记录表!$A:$A=$C$2,ROW($B:$B),36500),ROW(E12)))&\"\")),\"\",VALUE(INDEX(信誉提升汇总记录表!E:E,SMALL(IF(信誉提升汇总记录表!$A:$A=$C$2,ROW($B:$B),36500),ROW(E12)))&\"\"))","v":""},{"$f":"INDEX(信誉提升汇总记录表!J:J,SMALL(IF(信誉提升汇总记录表!$A:$A=$C$2,ROW($B:$B),36500),ROW(F12)))&\"\"","v":""},{"$f":"INDEX(信誉提升汇总记录表!K:K,SMALL(IF(信誉提升汇总记录表!$A:$A=$C$2,ROW($B:$B),36500),ROW(G12)))&\"\"","v":""},{"$f":"INDEX(信誉提升汇总记录表!M:M,SMALL(IF(信誉提升汇总记录表!$A:$A=$C$2,ROW($B:$B),36500),ROW(H12)))&\"\"","v":""}]
{"$rows_left_out":180}
{"sheet":"螺旋计划款操作总表","index":3,"n_rows":19,"n_cols":24,"rows_kept":19,"cut":false,"hidden":false,"merged":[[0,2,0,23],[1,2,1,9],[1,10,1,16],[1,17,1,23],[18,2,18,9],[21,3,21,20]]}
[null,null,{"$f":"螺旋计划款信誉提升明细表!C2&\"-21天信誉提升螺旋计划表\"","v":"测试货号1-拼接撞色连衣裙-21天信誉提升螺旋计划表"}]
["固定","周   期","第一周",{"$nulls":7},"第二周",{"$nulls":6},"第三周"]
["固定","上架天数","上架当天","第1天","第2天","第3天","第4天","第5天","第6天","第7天","第8天","第9天","第10天","第11天","第12天","第13天","第14天","第15天","第16天","第17天","第18天","第19天","第20天","第21天"]
["自己填","上架日期","2014-07-21","2014-07-22","2014-07-23","2014-07-24","2014-07-25","2014-07-26","2014-07-27","2014-07-28","2014-07-29","2014-07-30","2014-07-31","2014-08-01","2014-08-02","2014-08-03","2014-08-04","2014-08-05","2014-08-06","2014-08-07","2014-08-08","2014-08-09","2014-08-10","2014-08-11"]
["自己填","上架星期","星期一","星期二","星期三","星期四","星期五","星期六","星期日","星期一","星期二","星期三","星期四","星期五","星期六","星期日","星期一","星期二","星期三","星期四","星期五","星期六","星期日","星期一"]
["自己填","真实流量",null,2,5,10,35,76,130,270,20,56,112,156,230,310,523,152,270,345,467,580,790,1600]
["自己填","真实销量",null,0,0,0,1,2,5,8,1,2,4,5,8,13,19,5,9,13,16,20,32,56]
["有公式","真实转换率",null,{"$f":"IF(D6=0,0,D7/D6)","v":0},{"$f":"IF(E6=0,0,E7/E6)","v":0},{"$f":"IF(F6=0,0,F7/F6)","v":0},{"$f":"IF(G6=0,0,G7/G6)","v":0.0285714285714286},{"$f":"IF(H6=0,0,H7/H6)","v":0.0263157894736842},{"$f":"IF(I6=0,0,I7/I6)","v":0.0384615384615385},{"$f":"IF(J6=0,0,J7/J6)","v":0.0296296296296296},{"$f":"IF(K6=0,0,K7/K6)","v":0.05},{"$f":"IF(L6=0,0,L7/L6)","v":0.0357142857142857},{"$f":"IF(M6=0,0,M7/M6)","v":0.0357142857142857},{"$f":"IF(N6=0,0,N7/N6)","v":0.032051282051282},{"$f":"IF(O6=0,0,O7/O6)","v":0.0347826086956522},{"$f":"IF(P6=0,0,P7/P6)","v":0.0419354838709677},{"$f":"IF(Q6=0,0,Q7/Q6)","v":0.0363288718929254},{"$f":"IF(R6=0,0,R7/R6)","v":0.0328947368421053},{"$f":"IF(S6=0,0,S7/S6)","v":0.0333333333333333},{"$f":"IF(T6=0,0,T7/T6)","v":0.0376811594202899},{"$f":"IF(U6=0,0,U7/U6)","v":0.0342612419700214},{"$f":"IF(V6=0,0,V7/V6)","v":0.0344827586206897},{"$f":"IF(W6=0,0,W7/W6)","v":0.0405063291139241},{"$f":"IF(X6=0,0,X7/X6)","v":0.035}]
["自己填","虚假流量占比真实流量",null,8,7,7,3,2,1.5,1.2,7,4,2.5,2,1.5,1.2,1,1.8,1.6,1.5,1.3,1.2,0.98,0.95]
["有公式","需要导入的虚假流量",null,{"$f":"IF(IF(D6=0,1,D6)*D9=0,\"\",IF(D6=0,1,D6)*D9)","v":16},{"$f":"IF(IF(E6=0,1,E6)*E9=0,\"\",IF(E6=0,1,E6)*E9)","v":35},{"$f":"IF(IF(F6=0,1,F6)*F9=0,\"\",IF(F6=0,1,F6)*F9)","v":70},{"$f":"IF(IF(G6=0,1,G6)*G9=0,\"\",IF(G6=0,1,G6)*G9)","v":105},{"$f":"IF(IF(H6=0,1,H6)*H9=0,\"\",IF(H6=0,1,H6)*H9)","v":152},{"$f":"IF(IF(I6=0,1,I6)*I9=0,\"\",IF(I6=0,1,I6)*I9)","v":195},{"$f":"IF(IF(J6=0,1,J6)*J9=0,\"\",IF(J6=0,1,J6)*J9)","v":324},{"$f":"IF(IF(K6=0,1,K6)*K9=0,\"\",IF(K6=0,1,K6)*K9)","v":140},{"$f":"IF(IF(L6=0,1,L6)*L9=0,\"\",IF(L6=0,1,L6)*L9)","v":224},{"$f":"IF(IF(M6=0,1,M6)*M9=0,\"\",IF(M6=0,1,M6)*M9)","v":280},{"$f":"IF(IF(N6=0,1,N6)*N9=0,\"\",IF(N6=0,1,N6)*N9)","v":312},{"$f":"IF(IF(O6=0,1,O6)*O9=0,\"\",IF(O6=0,1,O6)*O9)","v":345},{"$f":"IF(IF(P6=0,1,P6)*P9=0,\"\",IF(P6=0,1,P6)*P9)","v":372},{"$f":"IF(IF(Q6=0,1,Q6)*Q9=0,\"\",IF(Q6=0,1,Q6)*Q9)","v":523},{"$f":"IF(IF(R6=0,1,R6)*R9=0,\"\",IF(R6=0,1,R6)*R9)","v":273.6},{"$f":"IF(IF(S6=0,1,S6)*S9=0,\"\",IF(S6=0,1,S6)*S9)","v":432},{"$f":"IF(IF(T6=0,1,T6)*T9=0,\"\",IF(T6=0,1,T6)*T9)","v":517.5},{"$f":"IF(IF(U6=0,1,U6)*U9=0,\"\",IF(U6=0,1,U6)*U9)","v":607.1},{"$f":"IF(IF(V6=0,1,V6)*V9=0,\"\",IF(V6=0,1,V6)*V9)","v":696},{"$f":"IF(IF(W6=0,1,W6)*W9=0,\"\",IF(W6=0,1,W6)*W9)","v":774.2},{"$f":"IF(IF(X6=0,1,X6)*X9=0,\"\",IF(X6=0,1,X6)*X9)","v":1520}]
["固定","需要控制的转换率",null,0.035,0.023,0.023,0.02,0.045,0.055,0.045,0.035,0.023,0.023,0.02,0.045,0.055,0.045,0.035,0.023,0.023,0.02,0.045,0.055,0.045]
["有公式","需要导入的虚假销量",null,{"$f":"IF(D11=\"\",0,D11)*IF(D10=\"\",0,D10)","v":0.56},{"$f":"IF(E11=\"\",0,E11)*IF(E10=\"\",0,E10)","v":0.805},{"$f":"IF(F11=\"\",0,F11)*IF(F10=\"\",0,F10)","v":1.61},{"$f":"IF(G11=\"\",0,G11)*IF(G10=\"\",0,G10)","v":2.1},{"$f":"IF(H11=\"\",0,H11)*IF(H10=\"\",0,H10)","v":6.84},{"$f":"IF(I11=\"\",0,I11)*IF(I10=\"\",0,I10)","v":10.725},{"$f":"IF(J11=\"\",0,J11)*IF(J10=\"\",0,J10)","v":14.58},{"$f":"IF(K11=\"\",0,K11)*IF(K10=\"\",0,K10)","v":4.9},{"$f":"IF(L11=\"\",0,L11)*IF(L10=\"\",0,L10)","v":5.152},{"$f":"IF(M11=\"\",0,M11)*IF(M10=\"\",0,M10)","v":6.44},{"$f":"IF(N11=\"\",0,N11)*IF(N10=\"\",0,N10)","v":6.24},{"$f":"IF(O11=\"\",0,O11)*IF(O10=\"\",0,O10)","v":15.525},{"$f":"IF(P11=\"\",0,P11)*IF(P10=\"\",0,P10)","v":20.46},{"$f":"IF(Q11=\"\",0,Q11)*IF(Q10=\"\",0,Q10)","v":23.535},{"$f":"IF(R11=\"\",0,R11)*IF(R10=\"\",0,R10)","v":9.576},{"$f":"IF(S11=\"\",0,S11)*IF(S10=\"\",0,S10)","v":9.936},{"$f":"IF(T11=\"\",0,T11)*IF(T10=\"\",0,T10)","v":11.9025},{"$f":"IF(U11=\"\",0,U11)*IF(U10=\"\",0,U10)","v":12.142},{"$f":"IF(V11=\"\",0,V11)*IF(V10=\"\",0,V10)","v":31.32},{"$f":"IF(W11=\"\",0,W11)*IF(W10=\"\",0,W10)","v":42.581},{"$f":"IF(X11=\"\",0,X11)*IF(X10=\"\",0,X10)","v":68.4}]
["有公式","实际完成的虚假销量",null,{"$f":"IF(SUMIF(螺旋计划款信誉提升明细表!$A$4:$A$500,D$4,螺旋计划款信誉提升明细表!$E$4:$E$500)=0,\"\",SUMIF(螺旋计划款信誉提升明细表!$A$4:$A$500,D$4,螺旋计划款信誉提升明细表!$E$4:$E$500))","v":2},{"$f":"IF(SUMIF(螺旋计划款信誉提升明细表!$A$4:$A$500,E$4,螺旋计划款信誉提升明细表!$E$4:$E$500)=0,\"\",SUMIF(螺旋计划款信誉提升明细表!$A$4:$A$500,E$4,螺旋计划款信誉提升明细表!$E$4:$E$500))","v":3},{"$f":"IF(SUMIF(螺旋计划款信誉提升明细表!$A$4:$A$500,F$4,螺旋计划款信誉提升明细表!$E$4:$E$500)=0,\"\",SUMIF(螺旋计划款信誉提升明细表!$A$4:$A$500,F$4,螺旋计划款信誉提升明细表!$E$4:$E$500))","v":2},{"$f":"IF(SUMIF(螺旋计划款信誉提升明细表!$A$4:$A$500,G$4,螺旋计划款信誉提升明细表!$E$4:$E$500)=0,\"\",SUMIF(螺旋计划款信誉提升明细表!$A$4:$A$500,G$4,螺旋计划款信誉提升明细表!$E$4:$E$500))","v":""},{"$f":"IF(SUMIF(螺旋计划款信誉提升明细表!$A$4:$A$500,H$4,螺旋计划款信誉提升明细表!$E$4:$E$500)=0,\"\",SUMIF(螺旋计划款信誉提升明细表!$A$4:$A$500,H$4,螺旋计划款信誉提升明细表!$E$4:$E$500))","v":""},{"$f":"IF(SUMIF(螺旋计划款信誉提升明细表!$A$4:$A$500,I$4,螺旋计划款信誉提升明细表!$E$4:$E$500)=0,\"\",SUMIF(螺旋计划款信誉提升明细表!$A$4:$A$500,I$4,螺旋计划款信誉提升明细表!$E$4:$E$500))","v":""},{"$f":"IF(SUMIF(螺旋计划款信誉提升明细表!$A$4:$A$500,J$4,螺旋计划款信誉提升明细表!$E$4:$E$500)=0,\"\",SUMIF(螺旋计划款信誉提升明细表!$A$4:$A$500,J$4,螺旋计划款信誉提升明细表!$E$4:$E$500))","v":""},{"$f":"IF(SUMIF(螺旋计划款信誉提升明细表!$A$4:$A$500,K$4,螺旋计划款信誉提升明细表!$E$4:$E$500)=0,\"\",SUMIF(螺旋计划款信誉提升明细表!$A$4:$A$500,K$4,螺旋计划款信誉提升明细表!$E$4:$E$500))","v":""},{"$f":"IF(SUMIF(螺旋计划款信誉提升明细表!$A$4:$A$500,L$4,螺旋计划款信誉提升明细表!$E$4:$E$500)=0,\"\",SUMIF(螺旋计划款信誉提升明细表!$A$4:$A$500,L$4,螺旋计划款信誉提升明细表!$E$4:$E$500))","v":""},{"$f":"IF(SUMIF(螺旋计划款信誉提升明细表!$A$4:$A$500,M$4,螺旋计划款信誉提升明细表!$E$4:$E$500)=0,\"\",SUMIF(螺旋计划款信誉提升明细表!$A$4:$A$500,M$4,螺旋计划款信誉提升明细表!$E$4:$E$500))","v":""},{"$f":"IF(SUMIF(螺旋计划款信誉提升明细表!$A$4:$A$500,N$4,螺旋计划款信誉提升明细表!$E$4:$E$500)=0,\"\",SUMIF(螺旋计划款信誉提升明细表!$A$4:$A$500,N$4,螺旋计划款信誉提升明细表!$E$4:$E$500))","v":""},{"$f":"IF(SUMIF(螺旋计划款信誉提升明细表!$A$4:$A$500,O$4,螺旋计划款信誉提升明细表!$E$4:$E$500)=0,\"\",SUMIF(螺旋计划款信誉提升明细表!$A$4:$A$500,O$4,螺旋计划款信誉提升明细表!$E$4:$E$500))","v":""},{"$f":"IF(SUMIF(螺旋计划款信誉提升明细表!$A$4:$A$500,P$4,螺旋计划款信誉提升明细表!$E$4:$E$500)=0,\"\",SUMIF(螺旋计划款信誉提升明细表!$A$4:$A$500,P$4,螺旋计划款信誉提升明细表!$E$4:$E$500))","v":""},{"$f":"IF(SUMIF(螺旋计划款信誉提升明细表!$A$4:$A$500,Q$4,螺旋计划款信誉提升明细表!$E$4:$E$500)=0,\"\",SUMIF(螺旋计划款信誉提升明细表!$A$4:$A$500,Q$4,螺旋计划款信誉提升明细表!$E$4:$E$500))","v":""},{"$f":"IF(SUMIF(螺旋计划款信誉提升明细表!$A$4:$A$500,R$4,螺旋计划款信誉提升明细表!$E$4:$E$500)=0,\"\",SUMIF(螺旋计划款信誉提升明细表!$A$4:$A$500,R$4,螺旋计划款信誉提升明细表!$E$4:$E$500))","v":""},{"$f":"IF(SUMIF(螺旋计划款信誉提升明细表!$A$4:$A$500,S$4,螺旋计划款信誉提升明细表!$E$4:$E$500)=0,\"\",SUMIF(螺旋计划款信誉提升明细表!$A$4:$A$500,S$4,螺旋计划款信誉提升明细表!$E$4:$E$500))","v":""},{"$f":"IF(SUMIF(螺旋计划款信誉提升明细表!$A$4:$A$500,T$4,螺旋计划款信誉提升明细表!$E$4:$E$500)=0,\"\",SUMIF(螺旋计划款信誉提升明细表!$A$4:$A$500,T$4,螺旋计划款信誉提升明细表!$E$4:$E$500))","v":""},{"$f":"IF(SUMIF(螺旋计划款信誉提升明细表!$A$4:$A$500,U$4,螺旋计划款信誉提升明细表!$E$4:$E$500)=0,\"\",SUMIF(螺旋计划款信誉提升明细表!$A$4:$A$500,U$4,螺旋计划款信誉提升明细表!$E$4:$E$500))","v":""},{"$f":"IF(SUMIF(螺旋计划款信誉提升明细表!$A$4:$A$500,V$4,螺旋计划款信誉提升明细表!$E$4:$E$500)=0,\"\",SUMIF(螺旋计划款信誉提升明细表!$A$4:$A$500,V$4,螺旋计划款信誉提升明细表!$E$4:$E$500))","v":""},{"$f":"IF(SUMIF(螺旋计划款信誉提升明细表!$A$4:$A$500,W$4,螺旋计划款信誉提升明细表!$E$4:$E$500)=0,\"\",SUMIF(螺旋计划款信誉提升明细表!$A$4:$A$500,W$4,螺旋计划款信誉提升明细表!$E$4:$E$500))","v":""},{"$f":"IF(SUMIF(螺旋计划款信誉提升明细表!$A$4:$A$500,X$4,螺旋计划款信誉提升明细表!$E$4:$E$500)=0,\"\",SUMIF(螺旋计划款信誉提升明细表!$A$4:$A$500,X$4,螺旋计划款信誉提升明细表!$E$4:$E$500))","v":""}]
["有公式","实际总流量",null,{"$f":"D6+IF(D10=\"\",0,D10)","v":18},{"$f":"E6+IF(E10=\"\",0,E10)","v":40},{"$f":"F6+IF(F10=\"\",0,F10)","v":80},{"$f":"G6+IF(G10=\"\",0,G10)","v":140},{"$f":"H6+IF(H10=\"\",0,H10)","v":228},{"$f":"I6+IF(I10=\"\",0,I10)","v":325},{"$f":"J6+IF(J10=\"\",0,J10)","v":594},{"$f":"K6+IF(K10=\"\",0,K10)","v":160},{"$f":"L6+IF(L10=\"\",0,L10)","v":280},{"$f":"M6+IF(M10=\"\",0,M10)","v":392},{"$f":"N6+IF(N10=\"\",0,N10)","v":468},{"$f":"O6+IF(O10=\"\",0,O10)","v":575},{"$f":"P6+IF(P10=\"\",0,P10)","v":682},{"$f":"Q6+IF(Q10=\"\",0,Q10)","v":1046},{"$f":"R6+IF(R10=\"\",0,R10)","v":425.6},{"$f":"S6+IF(S10=\"\",0,S10)","v":702},{"$f":"T6+IF(T10=\"\",0,T10)","v":862.5},{"$f":"U6+IF(U10=\"\",0,U10)","v":1074.1},{"$f":"V6+IF(V10=\"\",0,V10)","v":1276},{"$f":"W6+IF(W10=\"\",0,W10)","v":1564.2},{"$f":"X6+IF(X10=\"\",0,X10)","v":3120}]
["有公式","实际总销量",null,{"$f":"IF(ISERROR(VALUE(D13)),IF(D7=0,\"\",D7),D7+D13)","v":2},{"$f":"IF(ISERROR(VALUE(E13)),IF(E7=0,\"\",E7),E7+E13)","v":3},{"$f":"IF(ISERROR(VALUE(F13)),IF(F7=0,\"\",F7),F7+F13)","v":2},{"$f":"IF(ISERROR(VALUE(G13)),IF(G7=0,\"\",G7),G7+G13)","v":1},{"$f":"IF(ISERROR(VALUE(H13)),IF(H7=0,\"\",H7),H7+H13)","v":2},{"$f":"IF(ISERROR(VALUE(I13)),IF(I7=0,\"\",I7),I7+I13)","v":5},{"$f":"IF(ISERROR(VALUE(J13)),IF(J7=0,\"\",J7),J7+J13)","v":8},{"$f":"IF(ISERROR(VALUE(K13)),IF(K7=0,\"\",K7),K7+K13)","v":1},{"$f":"IF(ISERROR(VALUE(L13)),IF(L7=0,\"\",L7),L7+L13)","v":2},{"$f":"IF(ISERROR(VALUE(M13)),IF(M7=0,\"\",M7),M7+M13)","v":4},{"$f":"IF(ISERROR(VALUE(N13)),IF(N7=0,\"\",N7),N7+N13)","v":5},{"$f":"IF(ISERROR(VALUE(O13)),IF(O7=0,\"\",O7),O7+O13)","v":8},{"$f":"IF(ISERROR(VALUE(P13)),IF(P7=0,\"\",P7),P7+P13)","v":13},{"$f":"IF(ISERROR(VALUE(Q13)),IF(Q7=0,\"\",Q7),Q7+Q13)","v":19},{"$f":"IF(ISERROR(VALUE(R13)),IF(R7=0,\"\",R7),R7+R13)","v":5},{"$f":"IF(ISERROR(VALUE(S13)),IF(S7=0,\"\",S7),S7+S13)","v":9},{"$f":"IF(ISERROR(VALUE(T13)),IF(T7=0,\"\",T7),T7+T13)","v":13},{"$f":"IF(ISERROR(VALUE(U13)),IF(U7=0,\"\",U7),U7+U13)","v":16},{"$f":"IF(ISERROR(VALUE(V13)),IF(V7=0,\"\",V7),V7+V13)","v":20},{"$f":"IF(ISERROR(VALUE(W13)),IF(W7=0,\"\",W7),W7+W13)","v":32},{"$f":"IF(ISERROR(VALUE(X13)),IF(X7=0,\"\",X7),X7+X13)","v":56}]
{"$rows_left_out":5}
{"sheet":"螺旋计划款操作效果图表","index":4,"n_rows":50,"n_cols":12,"rows_kept":50,"cut":false,"hidden":false,"merged":[]}
{"$rows_empty":48}
[null,"2 3 2 1 2 5  8",{"$nulls":4},"1 2 3 5 8 13 19",{"$nulls":4},"5   8  13  15  20  30  55"]
[null,"4 6 4 2 4 10 16",{"$nulls":4},"2 4 6 10 13 19"]

{"sheet":"Sheet1","index":5,"n_rows":0,"n_cols":0,"rows_kept":0,"cut":false,"hidden":false,"merged":[]}