{"text_format":"2","workbook":"xlsx","n_sheets":6,"sheets":["使用手册","信誉提升汇总记录表","螺旋计划款信誉提升明细表","螺旋计划款操作总表","螺旋计划款操作效果图表","Sheet1"],"not_rendered":{"charts":2,"images":0,"macros":0,"external_links":0,"defined_names":0,"comments":1,"pivot_tables":0},"unopened":[],"bounds":{"document_bytes":16777216,"sheet_cells":100000,"run_cost":"one","rows_first":2000,"rows_last":500,"rows_between":2000,"halvings":0,"cell_chars":16384,"cell_head_chars":4096},"cells_cut":0,"cells_raw":0,"read":"whole","date_system":"1900"}

{"sheet":"使用手册","index":0,"n_rows":18,"n_cols":3,"rows_kept":18,"cut":false,"hidden":false,"merged":[[0,1,0,2],[16,1,16,2],[17,1,17,2]]}
[null,"此表使用手册（已更新）"]
[]
[null,"信誉提升汇总记录表","此表用于记录信誉提升的资料，不论是信誉提升作为的资金结算，还是作为后续问题联系相关人员的凭证，都是很方便的。"]
[]
[]
[null,"螺旋计划款信誉提升明细表","此表只需填写需要加入螺旋计划的新品货号，即可自动生成，此表的数据均从“信誉提升汇总表”筛选而来，如果这张表中无数据，则无法生成。"]
[null,null,"此表只是从“信誉提升汇总表”中，导出填写的螺旋计划款的相关信誉提升记录，并且作为“螺旋计划款操作总表”计算当前转换率，完成率等的依据。"]
[]
[null,"螺旋计划款操作总表","此表是根据新品21天的权重，配合销量的有规律提升，打造新品爆款，保证搜索流量的来源。"]
[null,null,"如想打造某款新品，需在“螺旋计划款信誉提升明细表”中，填写对应的货号，即可自动生成此表。"]
[null,null,"此表中均采用公式计算，且，均经过测试数据测试，保证公式无误，切勿随意更改表格位置。"]
[null,null,"表中字段，均有批注，实时统计，实时计算，方便实操者把握时机。"]
[]
[null,"螺旋计划款操作效果图表","此表根据“螺旋计划款操作总表”的数据，自动生成对应的图表，方便操作者一目了然的观看。"]
[]
[]
[null,"注：更多使用功能，请看表内测试数据，推广必备。"]
[null,"转发请注明出处-派代：无语泪，微信：polantao8"]

{"sheet":"信誉提升汇总记录表","index":1,"n_rows":11,"n_cols":13,"rows_kept":11,"cut":false,"hidden":false,"merged":[[0,0,0,12]]}
["店铺名-信誉提升记录"]
["货号","刷单日期","刷单关键词","进店方式","购买件数","刷单金额","支付方式","有无佣金","是否结算","刷单人旺旺ID","来源","联系方式","备注"]
["测试货号1-拼接撞色连衣裙","2014-07-22"," ","直接进店",1,76,"垫付","无","已结算","旺旺2014001","QQ好友","QQ:123456789"]
["测试货号1-拼接撞色连衣裙","2014-07-22","拼接撞色连衣裙","搜索进店",1,76,"垫付","无","已结算","旺旺2014002","QQ群","QQ:123456789"]
["测试货号2-波西米亚长裙","2014-07-23","波西米亚长裙","搜索进店",1,98,"垫付","无","已结算","旺旺2014003","QT频道","QQ:123456789"]
["测试货号1-拼接撞色连衣裙","2014-07-23","拼接撞色连衣裙","搜索进店",1,72,"垫付","无","已结算","旺旺2014004","QQ好友","QQ:123456789"]
["测试货号1-拼接撞色连衣裙","2014-07-23","拼接撞色连衣裙","搜索进店",2,152,"转账","无","已结算","旺旺2014005","YY频道","QQ:123456789"]
["测试货号2-波西米亚长裙","2014-07-24","波西米亚长裙","搜索进店",1,98,"垫付","无","已结算","旺旺2014006","QQ好友","QQ:123456789"]
["测试货号3-田园小清新连衣裙","2014-07-24","田园小清新连衣裙","搜索进店",1,78,"垫付","无","已结算","旺旺2014007","YY频道","QQ:123456789"]
["测试货号1-拼接撞色连衣裙","2014-07-24","拼接撞色连衣裙","搜索进店",1,76,"垫付","无","已结算","旺旺2014008","YY频道","QQ:123456789"]
["测试货号1-拼接撞色连衣裙","2014-07-24","拼接撞色连衣裙","搜索进店",1,76,"垫付","无","已结算","旺旺2014009","QT频道","QQ:123456789"]

{"sheet":"螺旋计划款信誉提升明细表","index":2,"n_rows":194,"n_cols":8,"rows_kept":194,"cut":false,"hidden":false,"merged":[[0,0,0,7],[1,0,1,1],[1,2,1,7]]}
["单个宝贝信誉提升记录明细"]
["输入需要进入螺旋计划的货号，便可自动生成这张表（货号需与信誉提升记录名单中货号相同，且存在记录）",null,"测试货号1-拼接撞色连衣裙"]
["刷单日期","货号","刷单关键词","进店方式","购买件数","刷单人旺旺ID","来源","备注"]
[{"$f":"IF(B4=\"\",\"\",INDEX(信誉提升汇总记录表!B:B,SMALL(IF(信誉提升汇总记录表!$A:$A=$C$2,ROW($B:$B),36500),ROW(A1))))","v":"2014-07-22"},{"$f":"INDEX(信誉提升汇总记录表!A:A,SMALL(IF(信誉提升汇总记录表!$A:$A=$C$2,ROW($B:$B),36500),ROW(B1)))&\"\"","v":"测试货号1-拼接撞色连衣裙"},{"$f":"INDEX(信誉提升汇总记录表!C:C,SMALL(IF(信誉提升汇总记录表!$A:$A=$C$2,ROW($B:$B),36500),ROW(C1)))&\"\"","v":" "},{"$f":"INDEX(信誉提升汇总记录表!D:D,SMALL(IF(信誉提升汇总记录表!$A:$A=$C$2,ROW($B:$B),36500),ROW(D1)))&\"\"","v":"直接进店"},{"$f":"IF(ISERROR(VALUE(INDEX(信誉提升汇总记录表!E:E,SMALL(IF(信誉提升汇总记录表!$A:$A=$C$2,ROW($B:$B),36500),ROW(E1)))&\"\")),\"\",VALUE(INDEX(信誉提升汇总记录表!E:E,SMALL(IF(信誉提升汇总记录表!$A:$A=$C$2,ROW($B:$B),36500),ROW(E1)))&\"\"))","v":1},{"$f":"INDEX(信誉提升汇总记录表!J:J,SMALL(IF(信誉提升汇总记录表!$A:$A=$C$2,ROW($B:$B),36500),ROW(F1)))&\"\"","v":"旺旺2014001"},{"$f":"INDEX(信誉提升汇总记录表!K:K,SMALL(IF(信誉提升汇总记录表!$A:$A=$C$2,ROW($B:$B),36500),ROW(G1)))&\"\"","v":"QQ好友"},{"$f":"INDEX(信誉提升汇总记录表!M:M,SMALL(IF(信誉提升汇总记录表!$A:$A=$C$2,ROW($B:$B),36500),ROW(H1)))&\"\"","v":""}]
[{"$f":"IF(B5=\"\",\"\",INDEX(信誉提升汇总记录表!B:B,SMALL(IF(信誉提升汇总记录表!$A:$A=$C$2,ROW($B:$B),36500),ROW(A2))))","v":"2014-07-22"},{"$f":"INDEX(信誉提升汇总记录表!A:A,SMALL(IF(信誉提升汇总记录表!$A:$A=$C$2,ROW($B:$B),36500),ROW(B2)))&\"\"","v":"测试货号1-拼接撞色连衣裙"},{"$f":"INDEX(信誉提升汇总记录表!C:C,SMALL(IF(信誉提升汇总记录表!$A:$A=$C$2,ROW($B:$B),36500),ROW(C2)))&\"\"","v":"拼接撞色连衣裙"},{"$f":"INDEX(信誉提升汇总记录表!D:D,SMALL(IF(信誉提升汇总记录表!$A:$A=$C$2,ROW($B:$B),36500),ROW(D2)))&\"\"","v":"搜索进店"},{"$f":"IF(ISERROR(VALUE(INDEX(信誉提升汇总记录表!E:E,SMALL(IF(信誉提升汇总记录表!$A:$A=$C$2,ROW($B:$B),36500),ROW(E2)))&\"\")),\"\",VALUE(INDEX(信誉提升汇总记录表!E:E,SMALL(IF(信誉提升汇总记录表!$A:$A=$C$2,ROW($B:$B),36500),ROW(E2)))&\"\"))","v":1},{"$f":"INDEX(信誉提升汇总记录表!J:J,SMALL(IF(信誉提升汇总记录表!$A:$A=$C$2,ROW($B:$B),36500),ROW(F2)))&\"\"","v":"旺旺2014002"},{"$f":"INDEX(信誉提升汇总记录表!K:K,SMALL(IF(信誉提升汇总记录表!$A:$A=$C$2,ROW($B:$B),36500),ROW(G2)))&\"\"","v":"QQ群"},{"$f":"INDEX(信誉提升汇总记录表!M:M,SMALL(IF(信誉提升汇总记录表!$A:$A=$C$2,ROW($B:$B),36500),ROW(H2)))&\"\"","v":""}]
[{"$f":"IF(B6=\"\",\"\",INDEX(信誉提升汇总记录表!B:B,SMALL(IF(信誉提升汇总记录表!$A:$A=$C$2,ROW($B:$B),36500),ROW(A3))))","v":"2014-07-23"},{"$f":"INDEX(信誉提升汇总记录表!A:A,SMALL(IF(信誉提升汇总记录表!$A:$A=$C$2,ROW($B:$B),36500),ROW(B3)))&\"\"","v":"测试货号1-拼接撞色连衣裙"},{"$f":"INDEX(信誉提升汇总记录表!C:C,SMALL(IF(信誉提升汇总记录表!$A:$A=$C$2,ROW($B:$B),36500),ROW(C3)))&\"\"","v":"拼接撞色连衣裙"},{"$f":"INDEX(信誉提升汇总记录表!D:D,SMALL(IF(信誉提升汇总记录表!$A:$A=$C$2,ROW($B:$B),36500),ROW(D3)))&\"\"","v":"搜索进店"},{"$f":"IF(ISERROR(VALUE(INDEX(信誉提升汇总记录表!E:E,SMALL(IF(信誉提升汇总记录表!$A:$A=$C$2,ROW($B:$B),36500),ROW(E3)))&\"\")),\"\",VALUE(INDEX(信誉提升汇总记录表!E:E,SMALL(IF(信誉提升汇总记录表!$A:$A=$C$2,ROW($B:$B),36500),ROW(E3)))&\"\"))","v":1},{"$f":"INDEX(信誉提升汇总记录表!J:J,SMALL(IF(信誉提升汇总记录表!$A:$A=$C$2,ROW($B:$B),36500),ROW(F3)))&\"\"","v":"旺旺2014004"},{"$f":"INDEX(信誉提升汇总记录表!K:K,SMALL(IF(信誉提升汇总记录表!$A:$A=$C$2,ROW($B:$B),36500),ROW(G3)))&\"\"","v":"QQ好友"},{"$f":"INDEX(信誉提升汇总记录表!M:M,SMALL(IF(信誉提升汇总记录表!$A:$A=$C$2,ROW($B:$B),36500),ROW(H3)))&\"\"","v":""}]
[{"$f":"IF(B7=\"\",\"\",INDEX(信誉提升汇总记录表!B:B,SMALL(IF(信誉提升汇总记录表!$A:$A=$C$2,ROW($B:$B),36500),ROW(A4))))","v":"2014-07-23"},{"$f":"INDEX(信誉提升汇总记录表!A:A,SMALL(IF(信誉提升汇总记录表!$A:$A=$C$2,ROW($B:$B),36500),ROW(B4)))&\"\"","v":"测试货号1-拼接撞色连衣裙"},{"$f":"INDEX(信誉提升汇总记录表!C:C,SMALL(IF(信誉提升汇总记录表!$A:$A=$C$2,ROW($B:$B),36500),ROW(C4)))&\"\"","v":"拼接撞色连衣裙"},{"$f":"INDEX(信誉提升汇总记录表!D:D,SMALL(IF(信誉提升汇总记录表!$A:$A=$C$2,ROW($B:$B),36500),ROW(D4)))&\"\"","v":"搜索进店"},{"$f":"IF(ISERROR(VALUE(INDEX(信誉提升汇总记录表!E:E,SMALL(IF(信誉提升汇总记录表!$A:$A=$C$2,ROW($B:$B),36500),ROW(E4)))&\"\")),\"\",VALUE(INDEX(信誉提升汇总记录表!E:E,SMALL(IF(信誉提升汇总记录表!$A:$A=$C$2,ROW($B:$B),36500),ROW(E4)))&\"\"))","v":2},{"$f":"INDEX(信誉提升汇总记录表!J:J,SMALL(IF(信誉提升汇总记录表!$A:$A=$C$2,ROW($B:$B),36500),ROW(F4)))&\"\"","v":"旺旺2014005"},{"$f":"INDEX(信誉提升汇总记录表!K:K,SMALL(IF(信誉提升汇总记录表!$A:$A=$C$2,ROW($B:$B),36500),ROW(G4)))&\"\"","v":"YY频道"},{"$f":"INDEX(信誉提升汇总记录表!M:M,SMALL(IF(信誉提升汇总记录表!$A:$A=$C$2,ROW($B:$B),36500),ROW(H4)))&\"\"","v":""}]
[{"$f":"IF(B8=\"\",\"\",INDEX(信誉提升汇总记录表!B:B,SMALL(IF(信誉提升汇总记录表!$A:$A=$C$2,ROW($B:$B),36500),ROW(A5))))","v":"2014-07-24"},{"$f":"INDEX(信誉提升汇总记录表!A:A,SMALL(IF(信誉提升汇总记录表!$A:$A=$C$2,ROW($B:$B),36500),ROW(B5)))&\"\"","v":"测试货号1-拼接撞色连衣裙"},{"$f":"INDEX(信誉提升汇总记录表!C:C,SMALL(IF(信誉提升汇总记录表!$A:$A=$C$2,ROW($B:$B),36500),ROW(C5)))&\"\"","v":"拼接撞色连衣裙"},{"$f":"INDEX(信誉提升汇总记录表!D:D,SMALL(IF(信誉提升汇总记录表!$A:$A=$C$2,ROW($B:$B),36500),ROW(D5)))&\"\"","v":"搜索进店"},{"$f":"IF(ISERROR(VALUE(INDEX(信誉提升汇总记录表!E:E,SMALL(IF(信誉提升汇总记录表!$A:$A=$C$2,ROW($B:$B),36500),ROW(E5)))&\"\")),\"\",VALUE(INDEX(信誉提升汇总记录表!E:E,SMALL(IF(信誉提升汇总记录表!$A:$A=$C$2,ROW($B:$B),36500),ROW(E5)))&\"\"))","v":1},{"$f":"INDEX(信誉提升汇总记录表!J:J,SMALL(IF(信誉提升汇总记录表!$A:$A=$C$2,ROW($B:$B),36500),ROW(F5)))&\"\"","v":"旺旺2014008"},{"$f":"INDEX(信誉提升汇总记录表!K:K,SMALL(IF(信誉提升汇总记录表!$A:$A=$C$2,ROW($B:$B),36500),ROW(G5)))&\"\"","v":"YY频道"},{"$f":"INDEX(信誉提升汇总记录表!M:M,SMALL(IF(信誉提升汇总记录表!$A:$A=$C$2,ROW($B:$B),36500),ROW(H5)))&\"\"","v":""}]
[{"$f":"IF(B9=\"\",\"\",INDEX(信誉提升汇总记录表!B:B,SMALL(IF(信誉提升汇总记录表!$A:$A=$C$2,ROW($B:$B),36500),ROW(A6))))","v":"2014-07-24"},{"$f":"INDEX(信誉提升汇总记录表!A:A,SMALL(IF(信誉提升汇总记录表!$A:$A=$C$2,ROW($B:$B),36500),ROW(B6)))&\"\"","v":"测试货号1-拼接撞色连衣裙"},{"$f":"INDEX(信誉提升汇总记录表!C:C,SMALL(IF(信誉提升汇总记录表!$A:$A=$C$2,ROW($B:$B),36500),ROW(C6)))&\"\"","v":"拼接撞色连衣裙"},{"$f":"INDEX(信誉提升汇总记录表!D:D,SMALL(IF(信誉提升汇总记录表!$A:$A=$C$2,ROW($B:$B),36500),ROW(D6)))&\"\"","v":"搜索进店"},{"$f":"IF(ISERROR(VALUE(INDEX(信誉提升汇总记录表!E:E,SMALL(IF(信誉提升汇总记录表!$A:$A=$C$2,ROW($B:$B),36500),ROW(E6)))&\"\")),\"\",VALUE(INDEX(信誉提升汇总记录表!E:E,SMALL(IF(信誉提升汇总记录表!$A:$A=$C$2,ROW($B:$B),36500),ROW(E6)))&\"\"))","v":1},{"$f":"INDEX(信誉提升汇总记录表!J:J,SMALL(IF(信誉提升汇总记录表!$A:$A=$C$2,ROW($B:$B),36500),ROW(F6)))&\"\"","v":"旺旺2014009"},{"$f":"INDEX(信誉提升汇总记录表!K:K,SMALL(IF(信誉提升汇总记录表!$A:$A=$C$2,ROW($B:$B),36500),ROW(G6)))&\"\"","v":"QT频道"},{"$f":"INDEX(信誉提升汇总记录表!M:M,SMALL(IF(信誉提升汇总记录表!$A:$A=$C$2,ROW($B:$B),36500),ROW(H6)))&\"\"","v":""}]
[{"$f":"IF(B10=\"\",\"\",INDEX(信誉提升汇总记录表!B:B,SMALL(IF(信誉提升汇总记录表!$A:$A=$C$2,ROW($B:$B),36500),ROW(A7))))","v":""},{"$f":"INDEX(信誉提升汇总记录表!A:A,SMALL(IF(信誉提升汇总记录表!$A:$A=$C$2,ROW($B:$B),36500),ROW(B7)))&\"\"","v":""},{"$f":"INDEX(信誉提升汇总记录表!C:C,SMALL(IF(信誉提升汇总记录表!$A:$A=$C$2,ROW($B:$B),36500),ROW(C7)))&\"\"","v":""},{"$f":"INDEX(信誉提升汇总记录表!D:D,SMALL(IF(信誉提升汇总记录表!$A:$A=$C$2,ROW($B:$B),36500),ROW(D7)))&\"\"","v":""},{"$f":"IF(ISERROR(VALUE(INDEX(信誉提升汇总记录表!E:E,SMALL(IF(信誉提升汇总记录表!$A:$A=$C$2,ROW($B:$B),36500),ROW(E7)))&\"\")),\"\",VALUE(INDEX(信誉提升汇总记录表!E:E,SMALL(IF(信誉提升汇总记录表!$A:$A=$C$2,ROW($B:$B),36500),ROW(E7)))&\"\"))","v":""},{"$f":"INDEX(信誉提升汇总记录表!J:J,SMALL(IF(信誉提升汇总记录表!$A:$A=$C$2,ROW($B:$B),36500),ROW(F7)))&\"\"","v":""},{"$f":"INDEX(信誉提升汇总记录表!K:K,SMALL(IF(信誉提升汇总记录表!$A:$A=$C$2,ROW($B:$B),36500),ROW(G7)))&\"\"","v":""},{"$f":"INDEX(信誉提升汇总记录表!M:M,SMALL(IF(信誉提升汇总记录表!$A:$A=$C$2,ROW($B:$B),36500),ROW(H7)))&\"\"","v":""}]
[{"$f":"IF(B11=\"\",\"\",INDEX(信誉提升汇总记录表!B:B,SMALL(IF(信誉提升汇总记录表!$A:$A=$C$2,ROW($B:$B),36500),ROW(A8))))","v":""},{"$f":"INDEX(信誉提升汇总记录表!A:A,SMALL(IF(信誉提升汇总记录表!$A:$A=$C$2,ROW($B:$B),36500),ROW(B8)))&\"\"","v":""},{"$f":"INDEX(信誉提升汇总记录表!C:C,SMALL(IF(信誉提升汇总记录表!$A:$A=$C$2,ROW($B:$B),36500),ROW(C8)))&\"\"","v":""},{"$f":"INDEX(信誉提升汇总记录表!D:D,SMALL(IF(信誉提升汇总记录表!$A:$A=$C$2,ROW($B:$B),36500),ROW(D8)))&\"\"","v":""},{"$f":"IF(ISERROR(VALUE(INDEX(信誉提升汇总记录表!E:E,SMALL(IF(信誉提升汇总记录表!$A:$A=$C$2,ROW($B:$B),36500),ROW(E8)))&\"\")),\"\",VALUE(INDEX(信誉提升汇总记录表!E:E,SMALL(IF(信誉提升汇总记录表!$A:$A=$C$2,ROW($B:$B),36500),ROW(E8)))&\"\"))","v":""},{"$f":"INDEX(信誉提升汇总记录表!J:J,SMALL(IF(信誉提升汇总记录表!$A:$A=$C$2,ROW($B:$B),36500),ROW(F8)))&\"\"","v":""},{"$f":"INDEX(信誉提升汇总记录表!K:K,SMALL(IF(信誉提升汇总记录表!$A:$A=$C$2,ROW($B:$B),36500),ROW(G8)))&\"\"","v":""},{"$f":"INDEX(信誉提升汇总记录表!M:M,SMALL(IF(信誉提升汇总记录表!$A:$A=$C$2,ROW($B:$B),36500),ROW(H8)))&\"\"","v":""}]
[{"$f":"IF(B12=\"\",\"\",INDEX(信誉提升汇总记录表!B:B,SMALL(IF(信誉提升汇总记录表!$A:$A=$C$2,ROW($B:$B),36500),ROW(A9))))","v":""},{"$f":"INDEX(信誉提升汇总记录表!A:A,SMALL(IF(信誉提升汇总记录表!$A:$A=$C$2,ROW($B:$B),36500),ROW(B9)))&\"\"","v":""},{"$f":"INDEX(信誉提升汇总记录表!C:C,SMALL(IF(信誉提升汇总记录表!$A:$A=$C$2,ROW($B:$B),36500),ROW(C9)))&\"\"","v":""},{"$f":"INDEX(信誉提升汇总记录表!D:D,SMALL(IF(信誉提升汇总记录表!$A:$A=$C$2,ROW($B:$B),36500),ROW(D9)))&\"\"","v":""},{"$f":"IF(ISERROR(VALUE(INDEX(信誉提升汇总记录表!E:E,SMALL(IF(信誉提升汇总记录表!$A:$A=$C$2,ROW($B:$B),36500),ROW(E9)))&\"\")),\"\",VALUE(INDEX(信誉提升汇总记录表!E:E,SMALL(IF(信誉提升汇总记录表!$A:$A=$C$2,ROW($B:$B),36500),ROW(E9)))&\"\"))","v":""},{"$f":"INDEX(信誉提升汇总记录表!J:J,SMALL(IF(信誉提升汇总记录表!$A:$A=$C$2,ROW($B:$B),36500),ROW(F9)))&\"\"","v":""},{"$f":"INDEX(信誉提升汇总记录表!K:K,SMALL(IF(信誉提升汇总记录表!$A:$A=$C$2,ROW($B:$B),36500),ROW(G9)))&\"\"","v":""},{"$f":"INDEX(信誉提升汇总记录表!M:M,SMALL(IF(信誉提升汇总记录表!$A:$A=$C$2,ROW($B:$B),36500),ROW(H9)))&\"\"","v":""}]
[{"$f":"IF(B13=\"\",\"\",INDEX(信誉提升汇总记录表!B:B,SMALL(IF(信誉提升汇总记录表!$A:$A=$C$2,ROW($B:$B),36500),ROW(A10))))","v":""},{"$f":"INDEX(信誉提升汇总记录表!A:A,SMALL(IF(信誉提升汇总记录表!$A:$A=$C$2,ROW($B:$B),36500),ROW(B10)))&\"\"","v":""},{"$f":"INDEX(信誉提升汇总记录表!C:C,SMALL(IF(信誉提升汇总记录表!$A:$A=$C$2,ROW($B:$B),36500),ROW(C10)))&\"\"","v":""},{"$f":"INDEX(信誉提升汇总记录表!D:D,SMALL(IF(信誉提升汇总记录表!$A:$A=$C$2,ROW($B:$B),36500),ROW(D10)))&\"\"","v":""},{"$f":"IF(ISERROR(VALUE(INDEX(信誉提升汇总记录表!E:E,SMALL(IF(信誉提升汇总记录表!$A:$A=$C$2,ROW($B:$B),36500),ROW(E10)))&\"\")),\"\",VALUE(INDEX(信誉提升汇总记录表!E:E,SMALL(IF(信誉提升汇总记录表!$A:$A=$C$2,ROW($B:$B),36500),ROW(E10)))&\"\"))","v":""},{"$f":"INDEX(信誉提升汇总记录表!J:J,SMALL(IF(信誉提升汇总记录表!$A:$A=$C$2,ROW($B:$B),36500),ROW(F10)))&\"\"","v":""},{"$f":"INDEX(信誉提升汇总记录表!K:K,SMALL(IF(信誉提升汇总记录表!$A:$A=$C$2,ROW($B:$B),36500),ROW(G10)))&\"\"","v":""},{"$f":"INDEX(信誉提升汇总记录表!M:M,SMALL(IF(信誉提升汇总记录表!$A:$A=$C$2,ROW($B:$B),36500),ROW(H10)))&\"\"","v":""}]
[{"$f":"IF(B14=\"\",\"\",INDEX(信誉提升汇总记录表!B:B,SMALL(IF(信誉提升汇总记录表!$A:$A=$C$2,ROW($B:$B),36500),ROW(A11))))","v":""},{"$f":"INDEX(信誉提升汇总记录表!A:A,SMALL(IF(信誉提升汇总记录表!$A:$A=$C$2,ROW($B:$B),36500),ROW(B11)))&\"\"","v":""},{"$f":"INDEX(信誉提升汇总记录表!C:C,SMALL(IF(信誉提升汇总记录表!$A:$A=$C$2,ROW($B:$B),36500),ROW(C11)))&\"\"","v":""},{"$f":"INDEX(信誉提升汇总记录表!D:D,SMALL(IF(信誉提升汇总记录表!$A:$A=$C$2,ROW($B:$B),36500),ROW(D11)))&\"\"","v":""},{"$f":"IF(ISERROR(VALUE(INDEX(信誉提升汇总记录表!E:E,SMALL(IF(信誉提升汇总记录表!$A:$A=$C$2,ROW($B:$B),36500),ROW(E11)))&\"\")),\"\",VALUE(INDEX(信誉提升汇总记录表!E:E,SMALL(IF(信誉提升汇总记录表!$A:$A=$C$2,ROW($B:$B),36500),ROW(E11)))&\"\"))","v":""},{"$f":"INDEX(信誉提升汇总记录表!J:J,SMALL(IF(信誉提升汇总记录表!$A:$A=$C$2,ROW($B:$B),36500),ROW(F11)))&\"\"","v":""},{"$f":"INDEX(信誉提升汇总记录表!K:K,SMALL(IF(信誉提升汇总记录表!$A:$A=$C$2,ROW($B:$B),36500),ROW(G11)))&\"\"","v":""},{"$f":"INDEX(信誉提升汇总记录表!M:M,SMALL(IF(信誉提升汇总记录表!$A:$A=$C$2,ROW($B:$B),36500),ROW(H11)))&\"\"","v":""}]
[{"$f":"IF(B15=\"\",\"\",INDEX(信誉提升汇总记录表!B:B,SMALL(IF(信誉提升汇总记录表!$A:$A=$C$2,ROW($B:$B),36500),ROW(A12))))","v":""},{"$f":"INDEX(信誉提升汇总记录表!A:A,SMALL(IF(信誉提升汇总记录表!$A:$A=$C$2,ROW($B:$B),36500),ROW(B12)))&\"\"","v":""},{"$f":"INDEX(信誉提升汇总记录表!C:C,SMALL(IF(信誉提升汇总记录表!$A:$A=$C$2,ROW($B:$B),36500),ROW(C12)))&\"\"","v":""},{"$f":"INDEX(信誉提升汇总记录表!D:D,SMALL(IF(信誉提升汇总记录表!$A:$A=$C$2,ROW($B:$B),36500),ROW(D12)))&\"\"","v":""},{"$f":"IF(ISERROR(VALUE(INDEX(信誉提升汇总记录表!E:E,SMALL(IF(信誉提升汇总记录表!$A:$A=$C$2,ROW($B:$B),36500),ROW(E12)))&\"\")),\"\",VALUE(INDEX(信誉提升汇总记录表!E:E,SMALL(IF(信誉提升汇总记录表!$A:$A=$C$2,ROW($B:$B),36500),ROW(E12)))&\"\"))","v":""},{"$f":"INDEX(信誉提升汇总记录表!J:J,SMALL(IF(信誉提升汇总记录表!$A:$A=$C$2,ROW($B:$B),36500),ROW(F12)))&\"\"","v":""},{"$f":"INDEX(信誉提升汇总记录表!K:K,SMALL(IF(信誉提升汇总记录表!$A:$A=$C$2,ROW($B:$B),36500),ROW(G12)))&\"\"","v":""},{"$f":"INDEX(信誉提升汇总记录表!M:M,SMALL(IF(信誉提升汇总记录表!$A:$A=$C$2,ROW($B:$B),36500),ROW(H12)))&\"\"","v":""}]
[{"$f":"IF(B16=\"\",\"\",INDEX(信誉提升汇总记录表!B:B,SMALL(IF(信誉提升汇总记录表!$A:$A=$C$2,ROW($B:$B),36500),ROW(A13))))","v":""},{"$f":"INDEX(信誉提升汇总记录表!A:A,SMALL(IF(信誉提升汇总记录表!$A:$A=$C$2,ROW($B:$B),36500),ROW(B13)))&\"\"","v":""},{"$f":"INDEX(信誉提升汇总记录表!C:C,SMALL(IF(信誉提升汇总记录表!$A:$A=$C$2,ROW($B:$B),36500),ROW(C13)))&\"\"","v":""},{"$f":"INDEX(信誉提升汇总记录表!D:D,SMALL(IF(信誉提升汇总记录表!$A:$A=$C$2,ROW($B:$B),36500),ROW(D13)))&\"\"","v":""},{"$f":"IF(ISERROR(VALUE(INDEX(信誉提升汇总记录表!E:E,SMALL(IF(信誉提升汇总记录表!$A:$A=$C$2,ROW($B:$B),36500),ROW(E13)))&\"\")),\"\",VALUE(INDEX(信誉提升汇总记录表!E:E,SMALL(IF(信誉提升汇总记录表!$A:$A=$C$2,ROW($B:$B),36500),ROW(E13)))&\"\"))","v":""},{"$f":"INDEX(信誉提升汇总记录表!J:J,SMALL(IF(信誉提升汇总记录表!$A:$A=$C$2,ROW($B:$B),36500),ROW(F13)))&\"\"","v":""},{"$f":"INDEX(信誉提升汇总记录表!K:K,SMALL(IF(信誉提升汇总记录表!$A:$A=$C$2,ROW($B:$B),36500),ROW(G13)))&\"\"","v":""},{"$f":"INDEX(信誉提升汇总记录表!M:M,SMALL(IF(信誉提升汇总记录表!$A:$A=$C$2,ROW($B:$B),36500),ROW(H13)))&\"\"","v":""}]
[{"$f":"IF(B17=\"\",\"\",INDEX(信誉提升汇总记录表!B:B,SMALL(IF(信誉提升汇总记录表!$A:$A=$C$2,ROW($B:$B),36500),ROW(A14))))","v":""},{"$f":"INDEX(信誉提升汇总记录表!A:A,SMALL(IF(信誉提升汇总记录表!$A:$A=$C$2,ROW($B:$B),36500),ROW(B14)))&\"\"","v":""},{"$f":"INDEX(信誉提升汇总记录表!C:C,SMALL(IF(信誉提升汇总记录表!$A:$A=$C$2,ROW($B:$B),36500),ROW(C14)))&\"\"","v":""},{"$f":"INDEX(信誉提升汇总记录表!D:D,SMALL(IF(信誉提升汇总记录表!$A:$A=$C$2,ROW($B:$B),36500),ROW(D14)))&\"\"","v":""},{"$f":"IF(ISERROR(VALUE(INDEX(信誉提升汇总记录表!E:E,SMALL(IF(信誉提升汇总记录表!$A:$A=$C$2,ROW($B:$B),36500),ROW(E14)))&\"\")),\"\",VALUE(INDEX(信誉提升汇总记录表!E:E,SMALL(IF(信誉提升汇总记录表!$A:$A=$C$2,ROW($B:$B),36500),ROW(E14)))&\"\"))","v":""},{"$f":"INDEX(信誉提升汇总记录表!J:J,SMALL(IF(信誉提升汇总记录表!$A:$A=$C$2,ROW($B:$B),36500),ROW(F14)))&\"\"","v":""},{"$f":"INDEX(信誉提升汇总记录表!K:K,SMALL(IF(信誉提升汇总记录表!$A:$A=$C$2,ROW($B:$B),36500),ROW(G14)))&\"\"","v":""},{"$f":"INDEX(信誉提升汇总记录表!M:M,SMALL(IF(信誉提升汇总记录表!$A:$A=$C$2,ROW($B:$B),36500),ROW(H14)))&\"\"","v":""}]
[{"$f":"IF(B18=\"\",\"\",INDEX(信誉提升汇总记录表!B:B,SMALL(IF(信誉提升汇总记录表!$A:$A=$C$2,ROW($B:$B),36500),ROW(A15))))","v":""},{"$f":"INDEX(信誉提升汇总记录表!A:A,SMALL(IF(信誉提升汇总记录表!$A:$A=$C$2,ROW($B:$B),36500),ROW(B15)))&\"\"","v":""},{"$f":"INDEX(信誉提升汇总记录表!C:C,SMALL(IF(信誉提升汇总记录表!$A:$A=$C$2,ROW($B:$B),36500),ROW(C15)))&\"\"","v":""},{"$f":"INDEX(信誉提升汇总记录表!D:D,SMALL(IF(信誉提升汇总记录表!$A:$A=$C$2,ROW($B:$B),36500),ROW(D15)))&\"\"","v":""},{"$f":"IF(ISERROR(VALUE(INDEX(信誉提升汇总记录表!E:E,SMALL(IF(信誉提升汇总记录表!$A:$A=$C$2,ROW($B:$B),36500),ROW(E15)))&\"\")),\"\",VALUE(INDEX(信誉提升汇总记录表!E:E,SMALL(IF(信誉提升汇总记录表!$A:$A=$C$2,ROW($B:$B),36500),ROW(E15)))&\"\"))","v":""},{"$f":"INDEX(信誉提升汇总记录表!J:J,SMALL(IF(信誉提升汇总记录表!$A:$A=$C$2,ROW($B:$B),36500),ROW(F15)))&\"\"","v":""},{"$f":"INDEX(信誉提升汇总记录表!K:K,SMALL(IF(信誉提升汇总记录表!$A:$A=$C$2,ROW($B:$B),36500),ROW(G15)))&\"\"","v":""},{"$f":"INDEX(信誉提升汇总记录表!M:M,SMALL(IF(信誉提升汇总记录表!$A:$A=$C$2,ROW($B:$B),36500),ROW(H15)))&\"\"","v":""}]
[{"$f":"IF(B19=\"\",\"\",INDEX(信誉提升汇总记录表!B:B,SMALL(IF(信誉提升汇总记录表!$A:$A=$C$2,ROW($B:$B),36500),ROW(A16))))","v":""},{"$f":"INDEX(信誉提升汇总记录表!A:A,SMALL(IF(信誉提升汇总记录表!$A:$A=$C$2,ROW($B:$B),36500),ROW(B16)))&\"\"","v":""},{"$f":"INDEX(信誉提升汇总记录表!C:C,SMALL(IF(信誉提升汇总记录表!$A:$A=$C$2,ROW($B:$B),36500),ROW(C16)))&\"\"","v":""},{"$f":"INDEX(信誉提升汇总记录表!D:D,SMALL(IF(信誉提升汇总记录表!$A:$A=$C$2,ROW($B:$B),36500),ROW(D16)))&\"\"","v":""},{"$f":"IF(ISERROR(VALUE(INDEX(信誉提升汇总记录表!E:E,SMALL(IF(信誉提升汇总记录表!$A:$A=$C$2,ROW($B:$B),36500),ROW(E16)))&\"\")),\"\",VALUE(INDEX(信誉提升汇总记录表!E:E,SMALL(IF(信誉提升汇总记录表!$A:$A=$C$2,ROW($B:$B),36500),ROW(E16)))&\"\"))","v":""},{"$f":"INDEX(信誉提升汇总记录表!J:J,SMALL(IF(信誉提升汇总记录表!$A:$A=$C$2,ROW($B:$B),36500),ROW(F16)))&\"\"","v":""},{"$f":"INDEX(信誉提升汇总记录表!K:K,SMALL(IF(信誉提升汇总记录表!$A:$A=$C$2,ROW($B:$B),36500),ROW(G16)))&\"\"","v":""},{"$f":"INDEX(信誉提升汇总记录表!M:M,SMALL(IF(信誉提升汇总记录表!$A:$A=$C$2,ROW($B:$B),36500),ROW(H16)))&\"\"","v":""}]
[{"$f":"IF(B20=\"\",\"\",INDEX(信誉提升汇总记录表!B:B,SMALL(IF(信誉提升汇总记录表!$A:$A=$C$2,ROW($B:$B),36500),ROW(A17))))","v":""},{"$f":"INDEX(信誉提升汇总记录表!A:A,SMALL(IF(信誉提升汇总记录表!$A:$A=$C$2,ROW($B:$B),36500),ROW(B17)))&\"\"","v":""},{"$f":"INDEX(信誉提升汇总记录表!C:C,SMALL(IF(信誉提升汇总记录表!$A:$A=$C$2,ROW($B:$B),36500),ROW(C17)))&\"\"","v":""},{"$f":"INDEX(信誉提升汇总记录表!D:D,SMALL(IF(信誉提升汇总记录表!$A:$A=$C$2,ROW($B:$B),36500),ROW(D17)))&\"\"","v":""},{"$f":"IF(ISERROR(VALUE(INDEX(信誉提升汇总记录表!E:E,SMALL(IF(信誉提升汇总记录表!$A:$A=$C$2,ROW($B:$B),36500),ROW(E17)))&\"\")),\"\",VALUE(INDEX(信誉提升汇总记录表!E:E,SMALL(IF(信誉提升汇总记录表!$A:$A=$C$2,ROW($B:$B),36500),ROW(E17)))&\"\"))","v":""},{"$f":"INDEX(信誉提升汇总记录表!J:J,SMALL(IF(信誉提升汇总记录表!$A:$A=$C$2,ROW($B:$B),36500),ROW(F17)))&\"\"","v":""},{"$f":"INDEX(信誉提升汇总记录表!K:K,SMALL(IF(信誉提升汇总记录表!$A:$A=$C$2,ROW($B:$B),36500),ROW(G17)))&\"\"","v":""},{"$f":"INDEX(信誉提升汇总记录表!M:M,SMALL(IF(信誉提升汇总记录表!$A:$A=$C$2,ROW($B:$B),36500),ROW(H17)))&\"\"","v":""}]
[{"$f":"IF(B21=\"\",\"\",INDEX(信誉提升汇总记录表!B:B,SMALL(IF(信誉提升汇总记录表!$A:$A=$C$2,ROW($B:$B),36500),ROW(A18))))","v":""},{"$f":"INDEX(信誉提升汇总记录表!A:A,SMALL(IF(信誉提升汇总记录表!$A:$A=$C$2,ROW($B:$B),36500),ROW(B18)))&\"\"","v":""},{"$f":"INDEX(信誉提升汇总记录表!C:C,SMALL(IF(信誉提升汇总记录表!$A:$A=$C$2,ROW($B:$B),36500),ROW(C18)))&\"\"","v":""},{"$f":"INDEX(信誉提升汇总记录表!D:D,SMALL(IF(信誉提升汇总记录表!$A:$A=$C$2,ROW($B:$B),36500),ROW(D18)))&\"\"","v":""},{"$f":"IF(ISERROR(VALUE(INDEX(信誉提升汇总记录表!E:E,SMALL(IF(信誉提升汇总记录表!$A:$A=$C$2,ROW($B:$B),36500),ROW(E18)))&\"\")),\"\",VALUE(INDEX(信誉提升汇总记录表!E:E,SMALL(IF(信誉提升汇总记录表!$A:$A=$C$2,ROW($B:$B),36500),ROW(E18)))&\"\"))","v":""},{"$f":"INDEX(信誉提升汇总记录表!J:J,SMALL(IF(信誉提升汇总记录表!$A:$A=$C$2,ROW($B:$B),36500),ROW(F18)))&\"\"","v":""},{"$f":"INDEX(信誉提升汇总记录表!K:K,SMALL(IF(信誉提升汇总记录表!$A:$A=$C$2,ROW($B:$B),36500),ROW(G18)))&\"\"","v":""},{"$f":"INDEX(信誉提升汇总记录表!M:M,SMALL(IF(信誉提升汇总记录表!$A:$A=$C$2,ROW($B:$B),36500),ROW(H18)))&\"\"","v":""}]
[{"$f":"IF(B22=\"\",\"\",INDEX(信誉提升汇总记录表!B:B,SMALL(IF(信誉提升汇总记录表!$A:$A=$C$2,ROW($B:$B),36500),ROW(A19))))","v":""},{"$f":"INDEX(信誉提升汇总记录表!A:A,SMALL(IF(信誉提升汇总记录表!$A:$A=$C$2,ROW($B:$B),36500),ROW(B19)))&\"\"","v":""},{"$f":"INDEX(信誉提升汇总记录表!C:C,SMALL(IF(信誉提升汇总记录表!$A:$A=$C$2,ROW($B:$B),36500),ROW(C19)))&\"\"","v":""},{"$f":"INDEX(信誉提升汇总记录表!D:D,SMALL(IF(信誉提升汇总记录表!$A:$A=$C$2,ROW($B:$B),36500),ROW(D19)))&\"\"","v":""},{"$f":"IF(ISERROR(VALUE(INDEX(信誉提升汇总记录表!E:E,SMALL(IF(信誉提升汇总记录表!$A:$A=$C$2,ROW($B:$B),36500),ROW(E19)))&\"\")),\"\",VALUE(INDEX(信誉提升汇总记录表!E:E,SMALL(IF(信誉提升汇总记录表!$A:$A=$C$2,ROW($B:$B),36500),ROW(E19)))&\"\"))","v":""},{"$f":"INDEX(信誉提升汇总记录表!J:J,SMALL(IF(信誉提升汇总记录表!$A:$A=$C$2,ROW($B:$B),36500),ROW(F19)))&\"\"","v":""},{"$f":"INDEX(信誉提升汇总记录表!K:K,SMALL(IF(信誉提升汇总记录表!$A:$A=$C$2,ROW($B:$B),36500),ROW(G19)))&\"\"","v":""},{"$f":"INDEX(信誉提升汇总记录表!M:M,SMALL(IF(信誉提升汇总记录表!$A:$A=$C$2,ROW($B:$B),36500),ROW(H19)))&\"\"","v":""}]
[{"$f":"IF(B23=\"\",\"\",INDEX(信誉提升汇总记录表!B:B,SMALL(IF(信誉提升汇总记录表!$A:$A=$C$2,ROW($B:$B),36500),ROW(A20))))","v":""},{"$f":"INDEX(信誉提升汇总记录表!A:A,SMALL(IF(信誉提升汇总记录表!$A:$A=$C$2,ROW($B:$B),36500),ROW(B20)))&\"\"","v":""},{"$f":"INDEX(信誉提升汇总记录表!C:C,SMALL(IF(信誉提升汇总记录表!$A:$A=$C$2,ROW($B:$B),36500),ROW(C20)))&\"\"","v":""},{"$f":"INDEX(信誉提升汇总记录表!D:D,SMALL(IF(信誉提升汇总记录表!$A:$A=$C$2,ROW($B:$B),36500),ROW(D20)))&\"\"","v":""},{"$f":"IF(ISERROR(VALUE(INDEX(信誉提升汇总记录表!E:E,SMALL(IF(信誉提升汇总记录表!$A:$A=$C$2,ROW($B:$B),36500),ROW(E20)))&\"\")),\"\",VALUE(INDEX(信誉提升汇总记录表!E:E,SMALL(IF(信誉提升汇总记录表!$A:$A=$C$2,ROW($B:$B),36500),ROW(E20)))&\"\"))","v":""},{"$f":"INDEX(信誉提升汇总记录表!J:J,SMALL(IF(信誉提升汇总记录表!$A:$A=$C$2,ROW($B:$B),36500),ROW(F20)))&\"\"","v":""},{"$f":"INDEX(信誉提升汇总记录表!K:K,SMALL(IF(信誉提升汇总记录表!$A:$A=$C$2,ROW($B:$B),36500),ROW(G20)))&\"\"","v":""},{"$f":"INDEX(信誉提升汇总记录表!M:M,SMALL(IF(信誉提升汇总记录表!$A:$A=$C$2,ROW($B:$B),36500),ROW(H20)))&\"\"","v":""}]
[{"$f":"IF(B24=\"\",\"\",INDEX(信誉提升汇总记录表!B:B,SMALL(IF(信誉提升汇总记录表!$A:$A=$C$2,ROW($B:$B),36500),ROW(A21))))","v":""},{"$f":"INDEX(信誉提升汇总记录表!A:A,SMALL(IF(信誉提升汇总记录表!$A:$A=$C$2,ROW($B:$B),36500),ROW(B21)))&\"\"","v":""},{"$f":"INDEX(信誉提升汇总记录表!C:C,SMALL(IF(信誉提升汇总记录表!$A:$A=$C$2,ROW($B:$B),36500),ROW(C21)))&\"\"","v":""},{"$f":"INDEX(信誉提升汇总记录表!D:D,SMALL(IF(信誉提升汇总记录表!$A:$A=$C$2,ROW($B:$B),36500),ROW(D21)))&\"\"","v":""},{"$f":"IF(ISERROR(VALUE(INDEX(信誉提升汇总记录表!E:E,SMALL(IF(信誉提升汇总记录表!$A:$A=$C$2,ROW($B:$B),36500),ROW(E21)))&\"\")),\"\",VALUE(INDEX(信誉提升汇总记录表!E:E,SMALL(IF(信誉提升汇总记录表!$A:$A=$C$2,ROW($B:$B),36500),ROW(E21)))&\"\"))","v":""},{"$f":"INDEX(信誉提升汇总记录表!J:J,SMALL(IF(信誉提升汇总记录表!$A:$A=$C$2,ROW($B:$B),36500),ROW(F21)))&\"\"","v":""},{"$f":"INDEX(信誉提升汇总记录表!K:K,SMALL(IF(信誉提升汇总记录表!$A:$A=$C$2,ROW($B:$B),36500),ROW(G21)))&\"\"","v":""},{"$f":"INDEX(信誉提升汇总记录表!M:M,SMALL(IF(信誉提升汇总记录表!$A:$A=$C$2,ROW($B:$B),36500),ROW(H21)))&\"\"","v":""}]
[{"$f":"IF(B25=\"\",\"\",INDEX(信誉提升汇总记录表!B:B,SMALL(IF(信誉提升汇总记录表!$A:$A=$C$2,ROW($B:$B),36500),ROW(A22))))","v":""},{"$f":"INDEX(信誉提升汇总记录表!A:A,SMALL(IF(信誉提升汇总记录表!$A:$A=$C$2,ROW($B:$B),36500),ROW(B22)))&\"\"","v":""},{"$f":"INDEX(信誉提升汇总记录表!C:C,SMALL(IF(信誉提升汇总记录表!$A:$A=$C$2,ROW($B:$B),36500),ROW(C22)))&\"\"","v":""},{"$f":"INDEX(信誉提升汇总记录表!D:D,SMALL(IF(信誉提升汇总记录表!$A:$A=$C$2,ROW($B:$B),36500),ROW(D22)))&\"\"","v":""},{"$f":"IF(ISERROR(VALUE(INDEX(信誉提升汇总记录表!E:E,SMALL(IF(信誉提升汇总记录表!$A:$A=$C$2,ROW($B:$B),36500),ROW(E22)))&\"\")),\"\",VALUE(INDEX(信誉提升汇总记录表!E:E,SMALL(IF(信誉提升汇总记录表!$A:$A=$C$2,ROW($B:$B),36500),ROW(E22)))&\"\"))","v":""},{"$f":"INDEX(信誉提升汇总记录表!J:J,SMALL(IF(信誉提升汇总记录表!$A:$A=$C$2,ROW($B:$B),36500),ROW(F22)))&\"\"","v":""},{"$f":"INDEX(信誉提升汇总记录表!K:K,SMALL(IF(信誉提升汇总记录表!$A:$A=$C$2,ROW($B:$B),36500),ROW(G22)))&\"\"","v":""},{"$f":"INDEX(信誉提升汇总记录表!M:M,SMALL(IF(信誉提升汇总记录表!$A:$A=$C$2,ROW($B:$B),36500),ROW(H22)))&\"\"","v":""}]
[{"$f":"IF(B26=\"\",\"\",INDEX(信誉提升汇总记录表!B:B,SMALL(IF(信誉提升汇总记录表!$A:$A=$C$2,ROW($B:$B),36500),ROW(A23))))","v":""},{"$f":"INDEX(信誉提升汇总记录表!A:A,SMALL(IF(信誉提升汇总记录表!$A:$A=$C$2,ROW($B:$B),36500),ROW(B23)))&\"\"","v":""},{"$f":"INDEX(信誉提升汇总记录表!C:C,SMALL(IF(信誉提升汇总记录表!$A:$A=$C$2,ROW($B:$B),36500),ROW(C23)))&\"\"","v":""},{"$f":"INDEX(信誉提升汇总记录表!D:D,SMALL(IF(信誉提升汇总记录表!$A:$A=$C$2,ROW($B:$B),36500),ROW(D23)))&\"\"","v":""},{"$f":"IF(ISERROR(VALUE(INDEX(信誉提升汇总记录表!E:E,SMALL(IF(信誉提升汇总记录表!$A:$A=$C$2,ROW($B:$B),36500),ROW(E23)))&\"\")),\"\",VALUE(INDEX(信誉提升汇总记录表!E:E,SMALL(IF(信誉提升汇总记录表!$A:$A=$C$2,ROW($B:$B),36500),ROW(E23)))&\"\"))","v":""},{"$f":"INDEX(信誉提升汇总记录表!J:J,SMALL(IF(信誉提升汇总记录表!$A:$A=$C$2,ROW($B:$B),36500),ROW(F23)))&\"\"","v":""},{"$f":"INDEX(信誉提升汇总记录表!K:K,SMALL(IF(信誉提升汇总记录表!$A:$A=$C$2,ROW($B:$B),36500),ROW(G23)))&\"\"","v":""},{"$f":"INDEX(信誉提升汇总记录表!M:M,SMALL(IF(信誉提升汇总记录表!$A:$A=$C$2,ROW($B:$B),36500),ROW(H23)))&\"\"","v":""}]
[{"$f":"IF(B27=\"\",\"\",INDEX(信誉提升汇总记录表!B:B,SMALL(IF(信誉提升汇总记录表!$A:$A=$C$2,ROW($B:$B),36500),ROW(A24))))","v":""},{"$f":"INDEX(信誉提升汇总记录表!A:A,SMALL(IF(信誉提升汇总记录表!$A:$A=$C$2,ROW($B:$B),36500),ROW(B24)))&\"\"","v":""},{"$f":"INDEX(信誉提升汇总记录表!C:C,SMALL(IF(信誉提升汇总记录表!$A:$A=$C$2,ROW($B:$B),36500),ROW(C24)))&\"\"","v":""},{"$f":"INDEX(信誉提升汇总记录表!D:D,SMALL(IF(信誉提升汇总记录表!$A:$A=$C$2,ROW($B:$B),36500),ROW(D24)))&\"\"","v":""},{"$f":"IF(ISERROR(VALUE(INDEX(信誉提升汇总记录表!E:E,SMALL(IF(信誉提升汇总记录表!$A:$A=$C$2,ROW($B:$B),36500),ROW(E24)))&\"\")),\"\",VALUE(INDEX(信誉提升汇总记录表!E:E,SMALL(IF(信誉提升汇总记录表!$A:$A=$C$2,ROW($B:$B),36500),ROW(E24)))&\"\"))","v":""},{"$f":"INDEX(信誉提升汇总记录表!J:J,SMALL(IF(信誉提升汇总记录表!$A:$A=$C$2,ROW($B:$B),36500),ROW(F24)))&\"\"","v":""},{"$f":"INDEX(信誉提升汇总记录表!K:K,SMALL(IF(信誉提升汇总记录表!$A:$A=$C$2,ROW($B:$B),36500),ROW(G24)))&\"\"","v":""},{"$f":"INDEX(信誉提升汇总记录表!M:M,SMALL(IF(信誉提升汇总记录表!$A:$A=$C$2,ROW($B:$B),36500),ROW(H24)))&\"\"","v":""}]
[{"$f":"IF(B28=\"\",\"\",INDEX(信誉提升汇总记录表!B:B,SMALL(IF(信誉提升汇总记录表!$A:$A=$C$2,ROW($B:$B),36500),ROW(A25))))","v":""},{"$f":"INDEX(信誉提升汇总记录表!A:A,SMALL(IF(信誉提升汇总记录表!$A:$A=$C$2,ROW($B:$B),36500),ROW(B25)))&\"\"","v":""},{"$f":"INDEX(信誉提升汇总记录表!C:C,SMALL(IF(信誉提升汇总记录表!$A:$A=$C$2,ROW($B:$B),36500),ROW(C25)))&\"\"","v":""},{"$f":"INDEX(信誉提升汇总记录表!D:D,SMALL(IF(信誉提升汇总记录表!$A:$A=$C$2,ROW($B:$B),36500),ROW(D25)))&\"\"","v":""},{"$f":"IF(ISERROR(VALUE(INDEX(信誉提升汇总记录表!E:E,SMALL(IF(信誉提升汇总记录表!$A:$A=$C$2,ROW($B:$B),36500),ROW(E25)))&\"\")),\"\",VALUE(INDEX(信誉提升汇总记录表!E:E,SMALL(IF(信誉提升汇总记录表!$A:$A=$C$2,ROW($B:$B),36500),ROW(E25)))&\"\"))","v":""},{"$f":"INDEX(信誉提升汇总记录表!J:J,SMALL(IF(信誉提升汇总记录表!$A:$A=$C$2,ROW($B:$B),36500),ROW(F25)))&\"\"","v":""},{"$f":"INDEX(信誉提升汇总记录表!K:K,SMALL(IF(信誉提升汇总记录表!$A:$A=$C$2,ROW($B:$B),36500),ROW(G25)))&\"\"","v":""},{"$f":"INDEX(信誉提升汇总记录表!M:M,SMALL(IF(信誉提升汇总记录表!$A:$A=$C$2,ROW($B:$B),36500),ROW(H25)))&\"\"","v":""}]
[{"$f":"IF(B29=\"\",\"\",INDEX(信誉提升汇总记录表!B:B,SMALL(IF(信誉提升汇总记录表!$A:$A=$C$2,ROW($B:$B),36500),ROW(A26))))","v":""},{"$f":"INDEX(信誉提升汇总记录表!A:A,SMALL(IF(信誉提升汇总记录表!$A:$A=$C$2,ROW($B:$B),36500),ROW(B26)))&\"\"","v":""},{"$f":"INDEX(信誉提升汇总记录表!C:C,SMALL(IF(信誉提升汇总记录表!$A:$A=$C$2,ROW($B:$B),36500),ROW(C26)))&\"\"","v":""},{"$f":"INDEX(信誉提升汇总记录表!D:D,SMALL(IF(信誉提升汇总记录表!$A:$A=$C$2,ROW($B:$B),36500),ROW(D26)))&\"\"","v":""},{"$f":"IF(ISERROR(VALUE(INDEX(信誉提升汇总记录表!E:E,SMALL(IF(信誉提升汇总记录表!$A:$A=$C$2,ROW($B:$B),36500),ROW(E26)))&\"\")),\"\",VALUE(INDEX(信誉提升汇总记录表!E:E,SMALL(IF(信誉提升汇总记录表!$A:$A=$C$2,ROW($B:$B),36500),ROW(E26)))&\"\"))","v":""},{"$f":"INDEX(信誉提升汇总记录表!J:J,SMALL(IF(信誉提升汇总记录表!$A:$A=$C$2,ROW($B:$B),36500),ROW(F26)))&\"\"","v":""},{"$f":"INDEX(信誉提升汇总记录表!K:K,SMALL(IF(信誉提升汇总记录表!$A:$A=$C$2,ROW($B:$B),36500),ROW(G26)))&\"\"","v":""},{"$f":"INDEX(信誉提升汇总记录表!M:M,SMALL(IF(信誉提升汇总记录表!$A:$A=$C$2,ROW($B:$B),36500),ROW(H26)))&\"\"","v":""}]
[{"$f":"IF(B30=\"\",\"\",INDEX(信誉提升汇总记录表!B:B,SMALL(IF(信誉提升汇总记录表!$A:$A=$C$2,ROW($B:$B),36500),ROW(A27))))","v":""},{"$f":"INDEX(信誉提升汇总记录表!A:A,SMALL(IF(信誉提升汇总记录表!$A:$A=$C$2,ROW($B:$B),36500),ROW(B27)))&\"\"","v":""},{"$f":"INDEX(信誉提升汇总记录表!C:C,SMALL(IF(信誉提升汇总记录表!$A:$A=$C$2,ROW($B:$B),36500),ROW(C27)))&\"\"","v":""},{"$f":"INDEX(信誉提升汇总记录表!D:D,SMALL(IF(信誉提升汇总记录表!$A:$A=$C$2,ROW($B:$B),36500),ROW(D27)))&\"\"","v":""},{"$f":"IF(ISERROR(VALUE(INDEX(信誉提升汇总记录表!E:E,SMALL(IF(信誉提升汇总记录表!$A:$A=$C$2,ROW($B:$B),36500),ROW(E27)))&\"\")),\"\",VALUE(INDEX(信誉提升汇总记录表!E:E,SMALL(IF(信誉提升汇总记录表!$A:$A=$C$2,ROW($B:$B),36500),ROW(E27)))&\"\"))","v":""},{"$f":"INDEX(信誉提升汇总记录表!J:J,SMALL(IF(信誉提升汇总记录表!$A:$A=$C$2,ROW($B:$B),36500),ROW(F27)))&\"\"","v":""},{"$f":"INDEX(信誉提升汇总记录表!K:K,SMALL(IF(信誉提升汇总记录表!$A:$A=$C$2,ROW($B:$B),36500),ROW(G27)))&\"\"","v":""},{"$f":"INDEX(信誉提升汇总记录表!M:M,SMALL(IF(信誉提升汇总记录表!$A:$A=$C$2,ROW($B:$B),36500),ROW(H27)))&\"\"","v":""}]
[{"$f":"IF(B31=\"\",\"\",INDEX(信誉提升汇总记录表!B:B,SMALL(IF(信誉提升汇总记录表!$A:$A=$C$2,ROW($B:$B),36500),ROW(A28))))","v":""},{"$f":"INDEX(信誉提升汇总记录表!A:A,SMALL(IF(信誉提升汇总记录表!$A:$A=$C$2,ROW($B:$B),36500),ROW(B28)))&\"\"","v":""},{"$f":"INDEX(信誉提升汇总记录表!C:C,SMALL(IF(信誉提升汇总记录表!$A:$A=$C$2,ROW($B:$B),36500),ROW(C28)))&\"\"","v":""},{"$f":"INDEX(信誉提升汇总记录表!D:D,SMALL(IF(信誉提升汇总记录表!$A:$A=$C$2,ROW($B:$B),36500),ROW(D28)))&\"\"","v":""},{"$f":"IF(ISERROR(VALUE(INDEX(信誉提升汇总记录表!E:E,SMALL(IF(信誉提升汇总记录表!$A:$A=$C$2,ROW($B:$B),36500),ROW(E28)))&\"\")),\"\",VALUE(INDEX(信誉提升汇总记录表!E:E,SMALL(IF(信誉提升汇总记录表!$A:$A=$C$2,ROW($B:$B),36500),ROW(E28)))&\"\"))","v":""},{"$f":"INDEX(信誉提升汇总记录表!J:J,SMALL(IF(信誉提升汇总记录表!$A:$A=$C$2,ROW($B:$B),36500),ROW(F28)))&\"\"","v":""},{"$f":"INDEX(信誉提升汇总记录表!K:K,SMALL(IF(信誉提升汇总记录表!$A:$A=$C$2,ROW($B:$B),36500),ROW(G28)))&\"\"","v":""},{"$f":"INDEX(信誉提升汇总记录表!M:M,SMALL(IF(信誉提升汇总记录表!$A:$A=$C$2,ROW($B:$B),36500),ROW(H28)))&\"\"","v":""}]
[{"$f":"IF(B32=\"\",\"\",INDEX(信誉提升汇总记录表!B:B,SMALL(IF(信誉提升汇总记录表!$A:$A=$C$2,ROW($B:$B),36500),ROW(A29))))","v":""},{"$f":"INDEX(信誉提升汇总记录表!A:A,SMALL(IF(信誉提升汇总记录表!$A:$A=$C$2,ROW($B:$B),36500),ROW(B29)))&\"\"","v":""},{"$f":"INDEX(信誉提升汇总记录表!C:C,SMALL(IF(信誉提升汇总记录表!$A:$A=$C$2,ROW($B:$B),36500),ROW(C29)))&\"\"","v":""},{"$f":"INDEX(信誉提升汇总记录表!D:D,SMALL(IF(信誉提升汇总记录表!$A:$A=$C$2,ROW($B:$B),36500),ROW(D29)))&\"\"","v":""},{"$f":"IF(ISERROR(VALUE(INDEX(信誉提升汇总记录表!E:E,SMALL(IF(信誉提升汇总记录表!$A:$A=$C$2,ROW($B:$B),36500),ROW(E29)))&\"\")),\"\",VALUE(INDEX(信誉提升汇总记录表!E:E,SMALL(IF(信誉提升汇总记录表!$A:$A=$C$2,ROW($B:$B),36500),ROW(E29)))&\"\"))","v":""},{"$f":"INDEX(信誉提升汇总记录表!J:J,SMALL(IF(信誉提升汇总记录表!$A:$A=$C$2,ROW($B:$B),36500),ROW(F29)))&\"\"","v":""},{"$f":"INDEX(信誉提升汇总记录表!K:K,SMALL(IF(信誉提升汇总记录表!$A:$A=$C$2,ROW($B:$B),36500),ROW(G29)))&\"\"","v":""},{"$f":"INDEX(信誉提升汇总记录表!M:M,SMALL(IF(信誉提升汇总记录表!$A:$A=$C$2,ROW($B:$B),36500),ROW(H29)))&\"\"","v":""}]
[{"$f":"IF(B33=\"\",\"\",INDEX(信誉提升汇总记录表!B:B,SMALL(IF(信誉提升汇总记录表!$A:$A=$C$2,ROW($B:$B),36500),ROW(A30))))","v":""},{"$f":"INDEX(信誉提升汇总记录表!A:A,SMALL(IF(信誉提升汇总记录表!$A:$A=$C$2,ROW($B:$B),36500),ROW(B30)))&\"\"","v":""},{"$f":"INDEX(信誉提升汇总记录表!C:C,SMALL(IF(信誉提升汇总记录表!$A:$A=$C$2,ROW($B:$B),36500),ROW(C30)))&\"\"","v":""},{"$f":"INDEX(信誉提升汇总记录表!D:D,SMALL(IF(信誉提升汇总记录表!$A:$A=$C$2,ROW($B:$B),36500),ROW(D30)))&\"\"","v":""},{"$f":"IF(ISERROR(VALUE(INDEX(信誉提升汇总记录表!E:E,SMALL(IF(信誉提升汇总记录表!$A:$A=$C$2,ROW($B:$B),36500),ROW(E30)))&\"\")),\"\",VALUE(INDEX(信誉提升汇总记录表!E:E,SMALL(IF(信誉提升汇总记录表!$A:$A=$C$2,ROW($B:$B),36500),ROW(E30)))&\"\"))","v":""},{"$f":"INDEX(信誉提升汇总记录表!J:J,SMALL(IF(信誉提升汇总记录表!$A:$A=$C$2,ROW($B:$B),36500),ROW(F30)))&\"\"","v":""},{"$f":"INDEX(信誉提升汇总记录表!K:K,SMALL(IF(信誉提升汇总记录表!$A:$A=$C$2,ROW($B:$B),36500),ROW(G30)))&\"\"","v":""},{"$f":"INDEX(信誉提升汇总记录表!M:M,SMALL(IF(信誉提升汇总记录表!$A:$A=$C$2,ROW($B:$B),36500),ROW(H30)))&\"\"","v":""}]
[{"$f":"IF(B34=\"\",\"\",INDEX(信誉提升汇总记录表!B:B,SMALL(IF(信誉提升汇总记录表!$A:$A=$C$2,ROW($B:$B),36500),ROW(A31))))","v":""},{"$f":"INDEX(信誉提升汇总记录表!A:A,SMALL(IF(信誉提升汇总记录表!$A:$A=$C$2,ROW($B:$B),36500),ROW(B31)))&\"\"","v":""},{"$f":"INDEX(信誉提升汇总记录表!C:C,SMALL(IF(信誉提升汇总记录表!$A:$A=$C$2,ROW($B:$B),36500),ROW(C31)))&\"\"","v":""},{"$f":"INDEX(信誉提升汇总记录表!D:D,SMALL(IF(信誉提升汇总记录表!$A:$A=$C$2,ROW($B:$B),36500),ROW(D31)))&\"\"","v":""},{"$f":"IF(ISERROR(VALUE(INDEX(信誉提升汇总记录表!E:E,SMALL(IF(信誉提升汇总记录表!$A:$A=$C$2,ROW($B:$B),36500),ROW(E31)))&\"\")),\"\",VALUE(INDEX(信誉提升汇总记录表!E:E,SMALL(IF(信誉提升汇总记录表!$A:$A=$C$2,ROW($B:$B),36500),ROW(E31)))&\"\"))","v":""},{"$f":"INDEX(信誉提升汇总记录表!J:J,SMALL(IF(信誉提升汇总记录表!$A:$A=$C$2,ROW($B:$B),36500),ROW(F31)))&\"\"","v":""},{"$f":"INDEX(信誉提升汇总记录表!K:K,SMALL(IF(信誉提升汇总记录表!$A:$A=$C$2,ROW($B:$B),36500),ROW(G31)))&\"\"","v":""},{"$f":"INDEX(信誉提升汇总记录表!M:M,SMALL(IF(信誉提升汇总记录表!$A:$A=$C$2,ROW($B:$B),36500),ROW(H31)))&\"\"","v":""}]
[{"$f":"IF(B35=\"\",\"\",INDEX(信誉提升汇总记录表!B:B,SMALL(IF(信誉提升汇总记录表!$A:$A=$C$2,ROW($B:$B),36500),ROW(A32))))","v":""},{"$f":"INDEX(信誉提升汇总记录表!A:A,SMALL(IF(信誉提升汇总记录表!$A:$A=$C$2,ROW($B:$B),36500),ROW(B32)))&\"\"","v":""},{"$f":"INDEX(信誉提升汇总记录表!C:C,SMALL(IF(信誉提升汇总记录表!$A:$A=$C$2,ROW($B:$B),36500),ROW(C32)))&\"\"","v":""},{"$f":"INDEX(信誉提升汇总记录表!D:D,SMALL(IF(信誉提升汇总记录表!$A:$A=$C$2,ROW($B:$B),36500),ROW(D32)))&\"\"","v":""},{"$f":"IF(ISERROR(VALUE(INDEX(信誉提升汇总记录表!E:E,SMALL(IF(信誉提升汇总记录表!$A:$A=$C$2,ROW($B:$B),36500),ROW(E32)))&\"\")),\"\",VALUE(INDEX(信誉提升汇总记录表!E:E,SMALL(IF(信誉提升汇总记录表!$A:$A=$C$2,ROW($B:$B),36500),ROW(E32)))&\"\"))","v":""},{"$f":"INDEX(信誉提升汇总记录表!J:J,SMALL(IF(信誉提升汇总记录表!$A:$A=$C$2,ROW($B:$B),36500),ROW(F32)))&\"\"","v":""},{"$f":"INDEX(信誉提升汇总记录表!K:K,SMALL(IF(信誉提升汇总记录表!$A:$A=$C$2,ROW($B:$B),36500),ROW(G32)))&\"\"","v":""},{"$f":"INDEX(信誉提升汇总记录表!M:M,SMALL(IF(信誉提升汇总记录表!$A:$A=$C$2,ROW($B:$B),36500),ROW(H32)))&\"\"","v":""}]
[{"$f":"IF(B36=\"\",\"\",INDEX(信誉提升汇总记录表!B:B,SMALL(IF(信誉提升汇总记录表!$A:$A=$C$2,ROW($B:$B),36500),ROW(A33))))","v":""},{"$f":"INDEX(信誉提升汇总记录表!A:A,SMALL(IF(信誉提升汇总记录表!$A:$A=$C$2,ROW($B:$B),36500),ROW(B33)))&\"\"","v":""},{"$f":"INDEX(信誉提升汇总记录表!C:C,SMALL(IF(信誉提升汇总记录表!$A:$A=$C$2,ROW($B:$B),36500),ROW(C33)))&\"\"","v":""},{"$f":"INDEX(信誉提升汇总记录表!D:D,SMALL(IF(信誉提升汇总记录表!$A:$A=$C$2,ROW($B:$B),36500),ROW(D33)))&\"\"","v":""},{"$f":"IF(ISERROR(VALUE(INDEX(信誉提升汇总记录表!E:E,SMALL(IF(信誉提升汇总记录表!$A:$A=$C$2,ROW($B:$B),36500),ROW(E33)))&\"\")),\"\",VALUE(INDEX(信誉提升汇总记录表!E:E,SMALL(IF(信誉提升汇总记录表!$A:$A=$C$2,ROW($B:$B),36500),ROW(E33)))&\"\"))","v":""},{"$f":"INDEX(信誉提升汇总记录表!J:J,SMALL(IF(信誉提升汇总记录表!$A:$A=$C$2,ROW($B:$B),36500),ROW(F33)))&\"\"","v":""},{"$f":"INDEX(信誉提升汇总记录表!K:K,SMALL(IF(信誉提升汇总记录表!$A:$A=$C$2,ROW($B:$B),36500),ROW(G33)))&\"\"","v":""},{"$f":"INDEX(信誉提升汇总记录表!M:M,SMALL(IF(信誉提升汇总记录表!$A:$A=$C$2,ROW($B:$B),36500),ROW(H33)))&\"\"","v":""}]
[{"$f":"IF(B37=\"\",\"\",INDEX(信誉提升汇总记录表!B:B,SMALL(IF(信誉提升汇总记录表!$A:$A=$C$2,ROW($B:$B),36500),ROW(A34))))","v":""},{"$f":"INDEX(信誉提升汇总记录表!A:A,SMALL(IF(信誉提升汇总记录表!$A:$A=$C$2,ROW($B:$B),36500),ROW(B34)))&\"\"","v":""},{"$f":"INDEX(信誉提升汇总记录表!C:C,SMALL(IF(信誉提升汇总记录表!$A:$A=$C$2,ROW($B:$B),36500),ROW(C34)))&\"\"","v":""},{"$f":"INDEX(信誉提升汇总记录表!D:D,SMALL(IF(信誉提升汇总记录表!$A:$A=$C$2,ROW($B:$B),36500),ROW(D34)))&\"\"","v":""},{"$f":"IF(ISERROR(VALUE(INDEX(信誉提升汇总记录表!E:E,SMALL(IF(信誉提升汇总记录表!$A:$A=$C$2,ROW($B:$B),36500),ROW(E34)))&\"\")),\"\",VALUE(INDEX(信誉提升汇总记录表!E:E,SMALL(IF(信誉提升汇总记录表!$A:$A=$C$2,ROW($B:$B),36500),ROW(E34)))&\"\"))","v":""},{"$f":"INDEX(信誉提升汇总记录表!J:J,SMALL(IF(信誉提升汇总记录表!$A:$A=$C$2,ROW($B:$B),36500),ROW(F34)))&\"\"","v":""},{"$f":"INDEX(信誉提升汇总记录表!K:K,SMALL(IF(信誉提升汇总记录表!$A:$A=$C$2,ROW($B:$B),36500),ROW(G34)))&\"\"","v":""},{"$f":"INDEX(信誉提升汇总记录表!M:M,SMALL(IF(信誉提升汇总记录表!$A:$A=$C$2,ROW($B:$B),36500),ROW(H34)))&\"\"","v":""}]
[{"$f":"IF(B38=\"\",\"\",INDEX(信誉提升汇总记录表!B:B,SMALL(IF(信誉提升汇总记录表!$A:$A=$C$2,ROW($B:$B),36500),ROW(A35))))","v":""},{"$f":"INDEX(信誉提升汇总记录表!A:A,SMALL(IF(信誉提升汇总记录表!$A:$A=$C$2,ROW($B:$B),36500),ROW(B35)))&\"\"","v":""},{"$f":"INDEX(信誉提升汇总记录表!C:C,SMALL(IF(信誉提升汇总记录表!$A:$A=$C$2,ROW($B:$B),36500),ROW(C35)))&\"\"","v":""},{"$f":"INDEX(信誉提升汇总记录表!D:D,SMALL(IF(信誉提升汇总记录表!$A:$A=$C$2,ROW($B:$B),36500),ROW(D35)))&\"\"","v":""},{"$f":"IF(ISERROR(VALUE(INDEX(信誉提升汇总记录表!E:E,SMALL(IF(信誉提升汇总记录表!$A:$A=$C$2,ROW($B:$B),36500),ROW(E35)))&\"\")),\"\",VALUE(INDEX(信誉提升汇总记录表!E:E,SMALL(IF(信誉提升汇总记录表!$A:$A=$C$2,ROW($B:$B),36500),ROW(E35)))&\"\"))","v":""},{"$f":"INDEX(信誉提升汇总记录表!J:J,SMALL(IF(信誉提升汇总记录表!$A:$A=$C$2,ROW($B:$B),36500),ROW(F35)))&\"\"","v":""},{"$f":"INDEX(信誉提升汇总记录表!K:K,SMALL(IF(信誉提升汇总记录表!$A:$A=$C$2,ROW($B:$B),36500),ROW(G35)))&\"\"","v":""},{"$f":"INDEX(信誉提升汇总记录表!M:M,SMALL(IF(信誉提升汇总记录表!$A:$A=$C$2,ROW($B:$B),36500),ROW(H35)))&\"\"","v":""}]
[{"$f":"IF(B39=\"\",\"\",INDEX(信誉提升汇总记录表!B:B,SMALL(IF(信誉提升汇总记录表!$A:$A=$C$2,ROW($B:$B),36500),ROW(A36))))","v":""},{"$f":"INDEX(信誉提升汇总记录表!A:A,SMALL(IF(信誉提升汇总记录表!$A:$A=$C$2,ROW($B:$B),36500),ROW(B36)))&\"\"","v":""},{"$f":"INDEX(信誉提升汇总记录表!C:C,SMALL(IF(信誉提升汇总记录表!$A:$A=$C$2,ROW($B:$B),36500),ROW(C36)))&\"\"","v":""},{"$f":"INDEX(信誉提升汇总记录表!D:D,SMALL(IF(信誉提升汇总记录表!$A:$A=$C$2,ROW($B:$B),36500),ROW(D36)))&\"\"","v":""},{"$f":"IF(ISERROR(VALUE(INDEX(信誉提升汇总记录表!E:E,SMALL(IF(信誉提升汇总记录表!$A:$A=$C$2,ROW($B:$B),36500),ROW(E36)))&\"\")),\"\",VALUE(INDEX(信誉提升汇总记录表!E:E,SMALL(IF(信誉提升汇总记录表!$A:$A=$C$2,ROW($B:$B),36500),ROW(E36)))&\"\"))","v":""},{"$f":"INDEX(信誉提升汇总记录表!J:J,SMALL(IF(信誉提升汇总记录表!$A:$A=$C$2,ROW($B:$B),36500),ROW(F36)))&\"\"","v":""},{"$f":"INDEX(信誉提升汇总记录表!K:K,SMALL(IF(信誉提升汇总记录表!$A:$A=$C$2,ROW($B:$B),36500),ROW(G36)))&\"\"","v":""},{"$f":"INDEX(信誉提升汇总记录表!M:M,SMALL(IF(信誉提升汇总记录表!$A:$A=$C$2,ROW($B:$B),36500),ROW(H36)))&\"\"","v":""}]
[{"$f":"IF(B40=\"\",\"\",INDEX(信誉提升汇总记录表!B:B,SMALL(IF(信誉提升汇总记录表!$A:$A=$C$2,ROW($B:$B),36500),ROW(A37))))","v":""},{"$f":"INDEX(信誉提升汇总记录表!A:A,SMALL(IF(信誉提升汇总记录表!$A:$A=$C$2,ROW($B:$B),36500),ROW(B37)))&\"\"","v":""},{"$f":"INDEX(信誉提升汇总记录表!C:C,SMALL(IF(信誉提升汇总记录表!$A:$A=$C$2,ROW($B:$B),36500),ROW(C37)))&\"\"","v":""},{"$f":"INDEX(信誉提升汇总记录表!D:D,SMALL(IF(信誉提升汇总记录表!$A:$A=$C$2,ROW($B:$B),36500),ROW(D37)))&\"\"","v":""},{"$f":"IF(ISERROR(VALUE(INDEX(信誉提升汇总记录表!E:E,SMALL(IF(信誉提升汇总记录表!$A:$A=$C$2,ROW($B:$B),36500),ROW(E37)))&\"\")),\"\",VALUE(INDEX(信誉提升汇总记录表!E:E,SMALL(IF(信誉提升汇总记录表!$A:$A=$C$2,ROW($B:$B),36500),ROW(E37)))&\"\"))","v":""},{"$f":"INDEX(信誉提升汇总记录表!J:J,SMALL(IF(信誉提升汇总记录表!$A:$A=$C$2,ROW($B:$B),36500),ROW(F37)))&\"\"","v":""},{"$f":"INDEX(信誉提升汇总记录表!K:K,SMALL(IF(信誉提升汇总记录表!$A:$A=$C$2,ROW($B:$B),36500),ROW(G37)))&\"\"","v":""},{"$f":"INDEX(信誉提升汇总记录表!M:M,SMALL(IF(信誉提升汇总记录表!$A:$A=$C$2,ROW($B:$B),36500),ROW(H37)))&\"\"","v":""}]
[{"$f":"IF(B41=\"\",\"\",INDEX(信誉提升汇总记录表!B:B,SMALL(IF(信誉提升汇总记录表!$A:$A=$C$2,ROW($B:$B),36500),ROW(A38))))","v":""},{"$f":"INDEX(信誉提升汇总记录表!A:A,SMALL(IF(信誉提升汇总记录表!$A:$A=$C$2,ROW($B:$B),36500),ROW(B38)))&\"\"","v":""},{"$f":"INDEX(信誉提升汇总记录表!C:C,SMALL(IF(信誉提升汇总记录表!$A:$A=$C$2,ROW($B:$B),36500),ROW(C38)))&\"\"","v":""},{"$f":"INDEX(信誉提升汇总记录表!D:D,SMALL(IF(信誉提升汇总记录表!$A:$A=$C$2,ROW($B:$B),36500),ROW(D38)))&\"\"","v":""},{"$f":"IF(ISERROR(VALUE(INDEX(信誉提升汇总记录表!E:E,SMALL(IF(信誉提升汇总记录表!$A:$A=$C$2,ROW($B:$B),36500),ROW(E38)))&\"\")),\"\",VALUE(INDEX(信誉提升汇总记录表!E:E,SMALL(IF(信誉提升汇总记录表!$A:$A=$C$2,ROW($B:$B),36500),ROW(E38)))&\"\"))","v":""},{"$f":"INDEX(信誉提升汇总记录表!J:J,SMALL(IF(信誉提升汇总记录表!$A:$A=$C$2,ROW($B:$B),36500),ROW(F38)))&\"\"","v":""},{"$f":"INDEX(信誉提升汇总记录表!K:K,SMALL(IF(信誉提升汇总记录表!$A:$A=$C$2,ROW($B:$B),36500),ROW(G38)))&\"\"","v":""},{"$f":"INDEX(信誉提升汇总记录表!M:M,SMALL(IF(信誉提升汇总记录表!$A:$A=$C$2,ROW($B:$B),36500),ROW(H38)))&\"\"","v":""}]
[{"$f":"IF(B42=\"\",\"\",INDEX(信誉提升汇总记录表!B:B,SMALL(IF(信誉提升汇总记录表!$A:$A=$C$2,ROW($B:$B),36500),ROW(A39))))","v":""},{"$f":"INDEX(信誉提升汇总记录表!A:A,SMALL(IF(信誉提升汇总记录表!$A:$A=$C$2,ROW($B:$B),36500),ROW(B39)))&\"\"","v":""},{"$f":"INDEX(信誉提升汇总记录表!C:C,SMALL(IF(信誉提升汇总记录表!$A:$A=$C$2,ROW($B:$B),36500),ROW(C39)))&\"\"","v":""},{"$f":"INDEX(信誉提升汇总记录表!D:D,SMALL(IF(信誉提升汇总记录表!$A:$A=$C$2,ROW($B:$B),36500),ROW(D39)))&\"\"","v":""},{"$f":"IF(ISERROR(VALUE(INDEX(信誉提升汇总记录表!E:E,SMALL(IF(信誉提升汇总记录表!$A:$A=$C$2,ROW($B:$B),36500),ROW(E39)))&\"\")),\"\",VALUE(INDEX(信誉提升汇总记录表!E:E,SMALL(IF(信誉提升汇总记录表!$A:$A=$C$2,ROW($B:$B),36500),ROW(E39)))&\"\"))","v":""},{"$f":"INDEX(信誉提升汇总记录表!J:J,SMALL(IF(信誉提升汇总记录表!$A:$A=$C$2,ROW($B:$B),36500),ROW(F39)))&\"\"","v":""},{"$f":"INDEX(信誉提升汇总记录表!K:K,SMALL(IF(信誉提升汇总记录表!$A:$A=$C$2,ROW($B:$B),36500),ROW(G39)))&\"\"","v":""},{"$f":"INDEX(信誉提升汇总记录表!M:M,SMALL(IF(信誉提升汇总记录表!$A:$A=$C$2,ROW($B:$B),36500),ROW(H39)))&\"\"","v":""}]
[{"$f":"IF(B43=\"\",\"\",INDEX(信誉提升汇总记录表!B:B,SMALL(IF(信誉提升汇总记录表!$A:$A=$C$2,ROW($B:$B),36500),ROW(A40))))","v":""},{"$f":"INDEX(信誉提升汇总记录表!A:A,SMALL(IF(信誉提升汇总记录表!$A:$A=$C$2,ROW($B:$B),36500),ROW(B40)))&\"\"","v":""},{"$f":"INDEX(信誉提升汇总记录表!C:C,SMALL(IF(信誉提升汇总记录表!$A:$A=$C$2,ROW($B:$B),36500),ROW(C40)))&\"\"","v":""},{"$f":"INDEX(信誉提升汇总记录表!D:D,SMALL(IF(信誉提升汇总记录表!$A:$A=$C$2,ROW($B:$B),36500),ROW(D40)))&\"\"","v":""},{"$f":"IF(ISERROR(VALUE(INDEX(信誉提升汇总记录表!E:E,SMALL(IF(信誉提升汇总记录表!$A:$A=$C$2,ROW($B:$B),36500),ROW(E40)))&\"\")),\"\",VALUE(INDEX(信誉提升汇总记录表!E:E,SMALL(IF(信誉提升汇总记录表!$A:$A=$C$2,ROW($B:$B),36500),ROW(E40)))&\"\"))","v":""},{"$f":"INDEX(信誉提升汇总记录表!J:J,SMALL(IF(信誉提升汇总记录表!$A:$A=$C$2,ROW($B:$B),36500),ROW(F40)))&\"\"","v":""},{"$f":"INDEX(信誉提升汇总记录表!K:K,SMALL(IF(信誉提升汇总记录表!$A:$A=$C$2,ROW($B:$B),36500),ROW(G40)))&\"\"","v":""},{"$f":"INDEX(信誉提升汇总记录表!M:M,SMALL(IF(信誉提升汇总记录表!$A:$A=$C$2,ROW($B:$B),36500),ROW(H40)))&\"\"","v":""}]
[{"$f":"IF(B44=\"\",\"\",INDEX(信誉提升汇总记录表!B:B,SMALL(IF(信誉提升汇总记录表!$A:$A=$C$2,ROW($B:$B),36500),ROW(A41))))","v":""},{"$f":"INDEX(信誉提升汇总记录表!A:A,SMALL(IF(信誉提升汇总记录表!$A:$A=$C$2,ROW($B:$B),36500),ROW(B41)))&\"\"","v":""},{"$f":"INDEX(信誉提升汇总记录表!C:C,SMALL(IF(信誉提升汇总记录表!$A:$A=$C$2,ROW($B:$B),36500),ROW(C41)))&\"\"","v":""},{"$f":"INDEX(信誉提升汇总记录表!D:D,SMALL(IF(信誉提升汇总记录表!$A:$A=$C$2,ROW($B:$B),36500),ROW(D41)))&\"\"","v":""},{"$f":"IF(ISERROR(VALUE(INDEX(信誉提升汇总记录表!E:E,SMALL(IF(信誉提升汇总记录表!$A:$A=$C$2,ROW($B:$B),36500),ROW(E41)))&\"\")),\"\",VALUE(INDEX(信誉提升汇总记录表!E:E,SMALL(IF(信誉提升汇总记录表!$A:$A=$C$2,ROW($B:$B),36500),ROW(E41)))&\"\"))","v":""},{"$f":"INDEX(信誉提升汇总记录表!J:J,SMALL(IF(信誉提升汇总记录表!$A:$A=$C$2,ROW($B:$B),36500),ROW(F41)))&\"\"","v":""},{"$f":"INDEX(信誉提升汇总记录表!K:K,SMALL(IF(信誉提升汇总记录表!$A:$A=$C$2,ROW($B:$B),36500),ROW(G41)))&\"\"","v":""},{"$f":"INDEX(信誉提升汇总记录表!M:M,SMALL(IF(信誉提升汇总记录表!$A:$A=$C$2,ROW($B:$B),36500),ROW(H41)))&\"\"","v":""}]
[{"$f":"IF(B45=\"\",\"\",INDEX(信誉提升汇总记录表!B:B,SMALL(IF(信誉提升汇总记录表!$A:$A=$C$2,ROW($B:$B),36500),ROW(A42))))","v":""},{"$f":"INDEX(信誉提升汇总记录表!A:A,SMALL(IF(信誉提升汇总记录表!$A:$A=$C$2,ROW($B:$B),36500),ROW(B42)))&\"\"","v":""},{"$f":"INDEX(信誉提升汇总记录表!C:C,SMALL(IF(信誉提升汇总记录表!$A:$A=$C$2,ROW($B:$B),36500),ROW(C42)))&\"\"","v":""},{"$f":"INDEX(信誉提升汇总记录表!D:D,SMALL(IF(信誉提升汇总记录表!$A:$A=$C$2,ROW($B:$B),36500),ROW(D42)))&\"\"","v":""},{"$f":"IF(ISERROR(VALUE(INDEX(信誉提升汇总记录表!E:E,SMALL(IF(信誉提升汇总记录表!$A:$A=$C$2,ROW($B:$B),36500),ROW(E42)))&\"\")),\"\",VALUE(INDEX(信誉提升汇总记录表!E:E,SMALL(IF(信誉提升汇总记录表!$A:$A=$C$2,ROW($B:$B),36500),ROW(E42)))&\"\"))","v":""},{"$f":"INDEX(信誉提升汇总记录表!J:J,SMALL(IF(信誉提升汇总记录表!$A:$A=$C$2,ROW($B:$B),36500),ROW(F42)))&\"\"","v":""},{"$f":"INDEX(信誉提升汇总记录表!K:K,SMALL(IF(信誉提升汇总记录表!$A:$A=$C$2,ROW($B:$B),36500),ROW(G42)))&\"\"","v":""},{"$f":"INDEX(信誉提升汇总记录表!M:M,SMALL(IF(信誉提升汇总记录表!$A:$A=$C$2,ROW($B:$B),36500),ROW(H42)))&\"\"","v":""}]
[{"$f":"IF(B46=\"\",\"\",INDEX(信誉提升汇总记录表!B:B,SMALL(IF(信誉提升汇总记录表!$A:$A=$C$2,ROW($B:$B),36500),ROW(A43))))","v":""},{"$f":"INDEX(信誉提升汇总记录表!A:A,SMALL(IF(信誉提升汇总记录表!$A:$A=$C$2,ROW($B:$B),36500),ROW(B43)))&\"\"","v":""},{"$f":"INDEX(信誉提升汇总记录表!C:C,SMALL(IF(信誉提升汇总记录表!$A:$A=$C$2,ROW($B:$B),36500),ROW(C43)))&\"\"","v":""},{"$f":"INDEX(信誉提升汇总记录表!D:D,SMALL(IF(信誉提升汇总记录表!$A:$A=$C$2,ROW($B:$B),36500),ROW(D43)))&\"\"","v":""},{"$f":"IF(ISERROR(VALUE(INDEX(信誉提升汇总记录表!E:E,SMALL(IF(信誉提升汇总记录表!$A:$A=$C$2,ROW($B:$B),36500),ROW(E43)))&\"\")),\"\",VALUE(INDEX(信誉提升汇总记录表!E:E,SMALL(IF(信誉提升汇总记录表!$A:$A=$C$2,ROW($B:$B),36500),ROW(E43)))&\"\"))","v":""},{"$f":"INDEX(信誉提升汇总记录表!J:J,SMALL(IF(信誉提升汇总记录表!$A:$A=$C$2,ROW($B:$B),36500),ROW(F43)))&\"\"","v":""},{"$f":"INDEX(信誉提升汇总记录表!K:K,SMALL(IF(信誉提升汇总记录表!$A:$A=$C$2,ROW($B:$B),36500),ROW(G43)))&\"\"","v":""},{"$f":"INDEX(信誉提升汇总记录表!M:M,SMALL(IF(信誉提升汇总记录表!$A:$A=$C$2,ROW($B:$B),36500),ROW(H43)))&\"\"","v":""}]
[{"$f":"IF(B47=\"\",\"\",INDEX(信誉提升汇总记录表!B:B,SMALL(IF(信誉提升汇总记录表!$A:$A=$C$2,ROW($B:$B),36500),ROW(A44))))","v":""},{"$f":"INDEX(信誉提升汇总记录表!A:A,SMALL(IF(信誉提升汇总记录表!$A:$A=$C$2,ROW($B:$B),36500),ROW(B44)))&\"\"","v":""},{"$f":"INDEX(信誉提升汇总记录表!C:C,SMALL(IF(信誉提升汇总记录表!$A:$A=$C$2,ROW($B:$B),36500),ROW(C44)))&\"\"","v":""},{"$f":"INDEX(信誉提升汇总记录表!D:D,SMALL(IF(信誉提升汇总记录表!$A:$A=$C$2,ROW($B:$B),36500),ROW(D44)))&\"\"","v":""},{"$f":"IF(ISERROR(VALUE(INDEX(信誉提升汇总记录表!E:E,SMALL(IF(信誉提升汇总记录表!$A:$A=$C$2,ROW($B:$B),36500),ROW(E44)))&\"\")),\"\",VALUE(INDEX(信誉提升汇总记录表!E:E,SMALL(IF(信誉提升汇总记录表!$A:$A=$C$2,ROW($B:$B),36500),ROW(E44)))&\"\"))","v":""},{"$f":"INDEX(信誉提升汇总记录表!J:J,SMALL(IF(信誉提升汇总记录表!$A:$A=$C$2,ROW($B:$B),36500),ROW(F44)))&\"\"","v":""},{"$f":"INDEX(信誉提升汇总记录表!K:K,SMALL(IF(信誉提升汇总记录表!$A:$A=$C$2,ROW($B:$B),36500),ROW(G44)))&\"\"","v":""},{"$f":"INDEX(信誉提升汇总记录表!M:M,SMALL(IF(信誉提升汇总记录表!$A:$A=$C$2,ROW($B:$B),36500),ROW(H44)))&\"\"","v":""}]
[{"$f":"IF(B48=\"\",\"\",INDEX(信誉提升汇总记录表!B:B,SMALL(IF(信誉提升汇总记录表!$A:$A=$C$2,ROW($B:$B),36500),ROW(A45))))","v":""},{"$f":"INDEX(信誉提升汇总记录表!A:A,SMALL(IF(信誉提升汇总记录表!$A:$A=$C$2,ROW($B:$B),36500),ROW(B45)))&\"\"","v":""},{"$f":"INDEX(信誉提升汇总记录表!C:C,SMALL(IF(信誉提升汇总记录表!$A:$A=$C$2,ROW($B:$B),36500),ROW(C45)))&\"\"","v":""},{"$f":"INDEX(信誉提升汇总记录表!D:D,SMALL(IF(信誉提升汇总记录表!$A:$A=$C$2,ROW($B:$B),36500),ROW(D45)))&\"\"","v":""},{"$f":"IF(ISERROR(VALUE(INDEX(信誉提升汇总记录表!E:E,SMALL(IF(信誉提升汇总记录表!$A:$A=$C$2,ROW($B:$B),36500),ROW(E45)))&\"\")),\"\",VALUE(INDEX(信誉提升汇总记录表!E:E,SMALL(IF(信誉提升汇总记录表!$A:$A=$C$2,ROW($B:$B),36500),ROW(E45)))&\"\"))","v":""},{"$f":"INDEX(信誉提升汇总记录表!J:J,SMALL(IF(信誉提升汇总记录表!$A:$A=$C$2,ROW($B:$B),36500),ROW(F45)))&\"\"","v":""},{"$f":"INDEX(信誉提升汇总记录表!K:K,SMALL(IF(信誉提升汇总记录表!$A:$A=$C$2,ROW($B:$B),36500),ROW(G45)))&\"\"","v":""},{"$f":"INDEX(信誉提升汇总记录表!M:M,SMALL(IF(信誉提升汇总记录表!$A:$A=$C$2,ROW($B:$B),36500),ROW(H45)))&\"\"","v":""}]
[{"$f":"IF(B49=\"\",\"\",INDEX(信誉提升汇总记录表!B:B,SMALL(IF(信誉提升汇总记录表!$A:$A=$C$2,ROW($B:$B),36500),ROW(A46))))","v":""},{"$f":"INDEX(信誉提升汇总记录表!A:A,SMALL(IF(信誉提升汇总记录表!$A:$A=$C$2,ROW($B:$B),36500),ROW(B46)))&\"\"","v":""},{"$f":"INDEX(信誉提升汇总记录表!C:C,SMALL(IF(信誉提升汇总记录表!$A:$A=$C$2,ROW($B:$B),36500),ROW(C46)))&\"\"","v":""},{"$f":"INDEX(信誉提升汇总记录表!D:D,SMALL(IF(信誉提升汇总记录表!$A:$A=$C$2,ROW($B:$B),36500),ROW(D46)))&\"\"","v":""},{"$f":"IF(ISERROR(VALUE(INDEX(信誉提升汇总记录表!E:E,SMALL(IF(信誉提升汇总记录表!$A:$A=$C$2,ROW($B:$B),36500),ROW(E46)))&\"\")),\"\",VALUE(INDEX(信誉提升汇总记录表!E:E,SMALL(IF(信誉提升汇总记录表!$A:$A=$C$2,ROW($B:$B),36500),ROW(E46)))&\"\"))","v":""},{"$f":"INDEX(信誉提升汇总记录表!J:J,SMALL(IF(信誉提升汇总记录表!$A:$A=$C$2,ROW($B:$B),36500),ROW(F46)))&\"\"","v":""},{"$f":"INDEX(信誉提升汇总记录表!K:K,SMALL(IF(信誉提升汇总记录表!$A:$A=$C$2,ROW($B:$B),36500),ROW(G46)))&\"\"","v":""},{"$f":"INDEX(信誉提升汇总记录表!M:M,SMALL(IF(信誉提升汇总记录表!$A:$A=$C$2,ROW($B:$B),36500),ROW(H46)))&\"\"","v":""}]
[{"$f":"IF(B50=\"\",\"\",INDEX(信誉提升汇总记录表!B:B,SMALL(IF(信誉提升汇总记录表!$A:$A=$C$2,ROW($B:$B),36500),ROW(A47))))","v":""},{"$f":"INDEX(信誉提升汇总记录表!A:A,SMALL(IF(信誉提升汇总记录表!$A:$A=$C$2,ROW($B:$B),36500),ROW(B47)))&\"\"","v":""},{"$f":"INDEX(信誉提升汇总记录表!C:C,SMALL(IF(信誉提升汇总记录表!$A:$A=$C$2,ROW($B:$B),36500),ROW(C47)))&\"\"","v":""},{"$f":"INDEX(信誉提升汇总记录表!D:D,SMALL(IF(信誉提升汇总记录表!$A:$A=$C$2,ROW($B:$B),36500),ROW(D47)))&\"\"","v":""},{"$f":"IF(ISERROR(VALUE(INDEX(信誉提升汇总记录表!E:E,SMALL(IF(信誉提升汇总记录表!$A:$A=$C$2,ROW($B:$B),36500),ROW(E47)))&\"\")),\"\",VALUE(INDEX(信誉提升汇总记录表!E:E,SMALL(IF(信誉提升汇总记录表!$A:$A=$C$2,ROW($B:$B),36500),ROW(E47)))&\"\"))","v":""},{"$f":"INDEX(信誉提升汇总记录表!J:J,SMALL(IF(信誉提升汇总记录表!$A:$A=$C$2,ROW($B:$B),36500),ROW(F47)))&\"\"","v":""},{"$f":"INDEX(信誉提升汇总记录表!K:K,SMALL(IF(信誉提升汇总记录表!$A:$A=$C$2,ROW($B:$B),36500),ROW(G47)))&\"\"","v":""},{"$f":"INDEX(信誉提升汇总记录表!M:M,SMALL(IF(信誉提升汇总记录表!$A:$A=$C$2,ROW($B:$B),36500),ROW(H47)))&\"\"","v":""}]
[{"$f":"IF(B51=\"\",\"\",INDEX(信誉提升汇总记录表!B:B,SMALL(IF(信誉提升汇总记录表!$A:$A=$C$2,ROW($B:$B),36500),ROW(A48))))","v":""},{"$f":"INDEX(信誉提升汇总记录表!A:A,SMALL(IF(信誉提升汇总记录表!$A:$A=$C$2,ROW($B:$B),36500),ROW(B48)))&\"\"","v":""},{"$f":"INDEX(信誉提升汇总记录表!C:C,SMALL(IF(信誉提升汇总记录表!$A:$A=$C$2,ROW($B:$B),36500),ROW(C48)))&\"\"","v":""},{"$f":"INDEX(信誉提升汇总记录表!D:D,SMALL(IF(信誉提升汇总记录表!$A:$A=$C$2,ROW($B:$B),36500),ROW(D48)))&\"\"","v":""},{"$f":"IF(ISERROR(VALUE(INDEX(信誉提升汇总记录表!E:E,SMALL(IF(信誉提升汇总记录表!$A:$A=$C$2,ROW($B:$B),36500),ROW(E48)))&\"\")),\"\",VALUE(INDEX(信誉提升汇总记录表!E:E,SMALL(IF(信誉提升汇总记录表!$A:$A=$C$2,ROW($B:$B),36500),ROW(E48)))&\"\"))","v":""},{"$f":"INDEX(信誉提升汇总记录表!J:J,SMALL(IF(信誉提升汇总记录表!$A:$A=$C$2,ROW($B:$B),36500),ROW(F48)))&\"\"","v":""},{"$f":"INDEX(信誉提升汇总记录表!K:K,SMALL(IF(信誉提升汇总记录表!$A:$A=$C$2,ROW($B:$B),36500),ROW(G48)))&\"\"","v":""},{"$f":"INDEX(信誉提升汇总记录表!M:M,SMALL(IF(信誉提升汇总记录表!$A:$A=$C$2,ROW($B:$B),36500),ROW(H48)))&\"\"","v":""}]
[{"$f":"IF(B52=\"\",\"\",INDEX(信誉提升汇总记录表!B:B,SMALL(IF(信誉提升汇总记录表!$A:$A=$C$2,ROW($B:$B),36500),ROW(A49))))","v":""},{"$f":"INDEX(信誉提升汇总记录表!A:A,SMALL(IF(信誉提升汇总记录表!$A:$A=$C$2,ROW($B:$B),36500),ROW(B49)))&\"\"","v":""},{"$f":"INDEX(信誉提升汇总记录表!C:C,SMALL(IF(信誉提升汇总记录表!$A:$A=$C$2,ROW($B:$B),36500),ROW(C49)))&\"\"","v":""},{"$f":"INDEX(信誉提升汇总记录表!D:D,SMALL(IF(信誉提升汇总记录表!$A:$A=$C$2,ROW($B:$B),36500),ROW(D49)))&\"\"","v":""},{"$f":"IF(ISERROR(VALUE(INDEX(信誉提升汇总记录表!E:E,SMALL(IF(信誉提升汇总记录表!$A:$A=$C$2,ROW($B:$B),36500),ROW(E49)))&\"\")),\"\",VALUE(INDEX(信誉提升汇总记录表!E:E,SMALL(IF(信誉提升汇总记录表!$A:$A=$C$2,ROW($B:$B),36500),ROW(E49)))&\"\"))","v":""},{"$f":"INDEX(信誉提升汇总记录表!J:J,SMALL(IF(信誉提升汇总记录表!$A:$A=$C$2,ROW($B:$B),36500),ROW(F49)))&\"\"","v":""},{"$f":"INDEX(信誉提升汇总记录表!K:K,SMALL(IF(信誉提升汇总记录表!$A:$A=$C$2,ROW($B:$B),36500),ROW(G49)))&\"\"","v":""},{"$f":"INDEX(信誉提升汇总记录表!M:M,SMALL(IF(信誉提升汇总记录表!$A:$A=$C$2,ROW($B:$B),36500),ROW(H49)))&\"\"","v":""}]
[{"$f":"IF(B53=\"\",\"\",INDEX(信誉提升汇总记录表!B:B,SMALL(IF(信誉提升汇总记录表!$A:$A=$C$2,ROW($B:$B),36500),ROW(A50))))","v":""},{"$f":"INDEX(信誉提升汇总记录表!A:A,SMALL(IF(信誉提升汇总记录表!$A:$A=$C$2,ROW($B:$B),36500),ROW(B50)))&\"\"","v":""},{"$f":"INDEX(信誉提升汇总记录表!C:C,SMALL(IF(信誉提升汇总记录表!$A:$A=$C$2,ROW($B:$B),36500),ROW(C50)))&\"\"","v":""},{"$f":"INDEX(信誉提升汇总记录表!D:D,SMALL(IF(信誉提升汇总记录表!$A:$A=$C$2,ROW($B:$B),36500),ROW(D50)))&\"\"","v":""},{"$f":"IF(ISERROR(VALUE(INDEX(信誉提升汇总记录表!E:E,SMALL(IF(信誉提升汇总记录表!$A:$A=$C$2,ROW($B:$B),36500),ROW(E50)))&\"\")),\"\",VALUE(INDEX(信誉提升汇总记录表!E:E,SMALL(IF(信誉提升汇总记录表!$A:$A=$C$2,ROW($B:$B),36500),ROW(E50)))&\"\"))","v":""},{"$f":"INDEX(信誉提升汇总记录表!J:J,SMALL(IF(信誉提升汇总记录表!$A:$A=$C$2,ROW($B:$B),36500),ROW(F50)))&\"\"","v":""},{"$f":"INDEX(信誉提升汇总记录表!K:K,SMALL(IF(信誉提升汇总记录表!$A:$A=$C$2,ROW($B:$B),36500),ROW(G50)))&\"\"","v":""},{"$f":"INDEX(信誉提升汇总记录表!M:M,SMALL(IF(信誉提升汇总记录表!$A:$A=$C$2,ROW($B:$B),36500),ROW(H50)))&\"\"","v":""}]
[{"$f":"IF(B54=\"\",\"\",INDEX(信誉提升汇总记录表!B:B,SMALL(IF(信誉提升汇总记录表!$A:$A=$C$2,ROW($B:$B),36500),ROW(A51))))","v":""},{"$f":"INDEX(信誉提升汇总记录表!A:A,SMALL(IF(信誉提升汇总记录表!$A:$A=$C$2,ROW($B:$B),36500),ROW(B51)))&\"\"","v":""},{"$f":"INDEX(信誉提升汇总记录表!C:C,SMALL(IF(信誉提升汇总记录表!$A:$A=$C$2,ROW($B:$B),36500),ROW(C51)))&\"\"","v":""},{"$f":"INDEX(信誉提升汇总记录表!D:D,SMALL(IF(信誉提升汇总记录表!$A:$A=$C$2,ROW($B:$B),36500),ROW(D51)))&\"\"","v":""},{"$f":"IF(ISERROR(VALUE(INDEX(信誉提升汇总记录表!E:E,SMALL(IF(信誉提升汇总记录表!$A:$A=$C$2,ROW($B:$B),36500),ROW(E51)))&\"\")),\"\",VALUE(INDEX(信誉提升汇总记录表!E:E,SMALL(IF(信誉提升汇总记录表!$A:$A=$C$2,ROW($B:$B),36500),ROW(E51)))&\"\"))","v":""},{"$f":"INDEX(信誉提升汇总记录表!J:J,SMALL(IF(信誉提升汇总记录表!$A:$A=$C$2,ROW($B:$B),36500),ROW(F51)))&\"\"","v":""},{"$f":"INDEX(信誉提升汇总记录表!K:K,SMALL(IF(信誉提升汇总记录表!$A:$A=$C$2,ROW($B:$B),36500),ROW(G51)))&\"\"","v":""},{"$f":"INDEX(信誉提升汇总记录表!M:M,SMALL(IF(信誉提升汇总记录表!$A:$A=$C$2,ROW($B:$B),36500),ROW(H51)))&\"\"","v":""}]
[{"$f":"IF(B55=\"\",\"\",INDEX(信誉提升汇总记录表!B:B,SMALL(IF(信誉提升汇总记录表!$A:$A=$C$2,ROW($B:$B),36500),ROW(A52))))","v":""},{"$f":"INDEX(信誉提升汇总记录表!A:A,SMALL(IF(信誉提升汇总记录表!$A:$A=$C$2,ROW($B:$B),36500),ROW(B52)))&\"\"","v":""},{"$f":"INDEX(信誉提升汇总记录表!C:C,SMALL(IF(信誉提升汇总记录表!$A:$A=$C$2,ROW($B:$B),36500),ROW(C52)))&\"\"","v":""},{"$f":"INDEX(信誉提升汇总记录表!D:D,SMALL(IF(信誉提升汇总记录表!$A:$A=$C$2,ROW($B:$B),36500),ROW(D52)))&\"\"","v":""},{"$f":"IF(ISERROR(VALUE(INDEX(信誉提升汇总记录表!E:E,SMALL(IF(信誉提升汇总记录表!$A:$A=$C$2,ROW($B:$B),36500),ROW(E52)))&\"\")),\"\",VALUE(INDEX(信誉提升汇总记录表!E:E,SMALL(IF(信誉提升汇总记录表!$A:$A=$C$2,ROW($B:$B),36500),ROW(E52)))&\"\"))","v":""},{"$f":"INDEX(信誉提升汇总记录表!J:J,SMALL(IF(信誉提升汇总记录表!$A:$A=$C$2,ROW($B:$B),36500),ROW(F52)))&\"\"","v":""},{"$f":"INDEX(信誉提升汇总记录表!K:K,SMALL(IF(信誉提升汇总记录表!$A:$A=$C$2,ROW($B:$B),36500),ROW(G52)))&\"\"","v":""},{"$f":"INDEX(信誉提升汇总记录表!M:M,SMALL(IF(信誉提升汇总记录表!$A:$A=$C$2,ROW($B:$B),36500),ROW(H52)))&\"\"","v":""}]
[{"$f":"IF(B56=\"\",\"\",INDEX(信誉提升汇总记录表!B:B,SMALL(IF(信誉提升汇总记录表!$A:$A=$C$2,ROW($B:$B),36500),ROW(A53))))","v":""},{"$f":"INDEX(信誉提升汇总记录表!A:A,SMALL(IF(信誉提升汇总记录表!$A:$A=$C$2,ROW($B:$B),36500),ROW(B53)))&\"\"","v":""},{"$f":"INDEX(信誉提升汇总记录表!C:C,SMALL(IF(信誉提升汇总记录表!$A:$A=$C$2,ROW($B:$B),36500),ROW(C53)))&\"\"","v":""},{"$f":"INDEX(信誉提升汇总记录表!D:D,SMALL(IF(信誉提升汇总记录表!$A:$A=$C$2,ROW($B:$B),36500),ROW(D53)))&\"\"","v":""},{"$f":"IF(ISERROR(VALUE(INDEX(信誉提升汇总记录表!E:E,SMALL(IF(信誉提升汇总记录表!$A:$A=$C$2,ROW($B:$B),36500),ROW(E53)))&\"\")),\"\",VALUE(INDEX(信誉提升汇总记录表!E:E,SMALL(IF(信誉提升汇总记录表!$A:$A=$C$2,ROW($B:$B),36500),ROW(E53)))&\"\"))","v":""},{"$f":"INDEX(信誉提升汇总记录表!J:J,SMALL(IF(信誉提升汇总记录表!$A:$A=$C$2,ROW($B:$B),36500),ROW(F53)))&\"\"","v":""},{"$f":"INDEX(信誉提升汇总记录表!K:K,SMALL(IF(信誉提升汇总记录表!$A:$A=$C$2,ROW($B:$B),36500),ROW(G53)))&\"\"","v":""},{"$f":"INDEX(信誉提升汇总记录表!M:M,SMALL(IF(信誉提升汇总记录表!$A:$A=$C$2,ROW($B:$B),36500),ROW(H53)))&\"\"","v":""}]
[{"$f":"IF(B57=\"\",\"\",INDEX(信誉提升汇总记录表!B:B,SMALL(IF(信誉提升汇总记录表!$A:$A=$C$2,ROW($B:$B),36500),ROW(A54))))","v":""},{"$f":"INDEX(信誉提升汇总记录表!A:A,SMALL(IF(信誉提升汇总记录表!$A:$A=$C$2,ROW($B:$B),36500),ROW(B54)))&\"\"","v":""},{"$f":"INDEX(信誉提升汇总记录表!C:C,SMALL(IF(信誉提升汇总记录表!$A:$A=$C$2,ROW($B:$B),36500),ROW(C54)))&\"\"","v":""},{"$f":"INDEX(信誉提升汇总记录表!D:D,SMALL(IF(信誉提升汇总记录表!$A:$A=$C$2,ROW($B:$B),36500),ROW(D54)))&\"\"","v":""},{"$f":"IF(ISERROR(VALUE(INDEX(信誉提升汇总记录表!E:E,SMALL(IF(信誉提升汇总记录表!$A:$A=$C$2,ROW($B:$B),36500),ROW(E54)))&\"\")),\"\",VALUE(INDEX(信誉提升汇总记录表!E:E,SMALL(IF(信誉提升汇总记录表!$A:$A=$C$2,ROW($B:$B),36500),ROW(E54)))&\"\"))","v":""},{"$f":"INDEX(信誉提升汇总记录表!J:J,SMALL(IF(信誉提升汇总记录表!$A:$A=$C$2,ROW($B:$B),36500),ROW(F54)))&\"\"","v":""},{"$f":"INDEX(信誉提升汇总记录表!K:K,SMALL(IF(信誉提升汇总记录表!$A:$A=$C$2,ROW($B:$B),36500),ROW(G54)))&\"\"","v":""},{"$f":"INDEX(信誉提升汇总记录表!M:M,SMALL(IF(信誉提升汇总记录表!$A:$A=$C$2,ROW($B:$B),36500),ROW(H54)))&\"\"","v":""}]
[{"$f":"IF(B58=\"\",\"\",INDEX(信誉提升汇总记录表!B:B,SMALL(IF(信誉提升汇总记录表!$A:$A=$C$2,ROW($B:$B),36500),ROW(A55))))","v":""},{"$f":"INDEX(信誉提升汇总记录表!A:A,SMALL(IF(信誉提升汇总记录表!$A:$A=$C$2,ROW($B:$B),36500),ROW(B55)))&\"\"","v":""},{"$f":"INDEX(信誉提升汇总记录表!C:C,SMALL(IF(信誉提升汇总记录表!$A:$A=$C$2,ROW($B:$B),36500),ROW(C55)))&\"\"","v":""},{"$f":"INDEX(信誉提升汇总记录表!D:D,SMALL(IF(信誉提升汇总记录表!$A:$A=$C$2,ROW($B:$B),36500),ROW(D55)))&\"\"","v":""},{"$f":"IF(ISERROR(VALUE(INDEX(信誉提升汇总记录表!E:E,SMALL(IF(信誉提升汇总记录表!$A:$A=$C$2,ROW($B:$B),36500),ROW(E55)))&\"\")),\"\",VALUE(INDEX(信誉提升汇总记录表!E:E,SMALL(IF(信誉提升汇总记录表!$A:$A=$C$2,ROW($B:$B),36500),ROW(E55)))&\"\"))","v":""},{"$f":"INDEX(信誉提升汇总记录表!J:J,SMALL(IF(信誉提升汇总记录表!$A:$A=$C$2,ROW($B:$B),36500),ROW(F55)))&\"\"","v":""},{"$f":"INDEX(信誉提升汇总记录表!K:K,SMALL(IF(信誉提升汇总记录表!$A:$A=$C$2,ROW($B:$B),36500),ROW(G55)))&\"\"","v":""},{"$f":"INDEX(信誉提升汇总记录表!M:M,SMALL(IF(信誉提升汇总记录表!$A:$A=$C$2,ROW($B:$B),36500),ROW(H55)))&\"\"","v":""}]
[{"$f":"IF(B59=\"\",\"\",INDEX(信誉提升汇总记录表!B:B,SMALL(IF(信誉提升汇总记录表!$A:$A=$C$2,ROW($B:$B),36500),ROW(A56))))","v":""},{"$f":"INDEX(信誉提升汇总记录表!A:A,SMALL(IF(信誉提升汇总记录表!$A:$A=$C$2,ROW($B:$B),36500),ROW(B56)))&\"\"","v":""},{"$f":"INDEX(信誉提升汇总记录表!C:C,SMALL(IF(信誉提升汇总记录表!$A:$A=$C$2,ROW($B:$B),36500),ROW(C56)))&\"\"","v":""},{"$f":"INDEX(信誉提升汇总记录表!D:D,SMALL(IF(信誉提升汇总记录表!$A:$A=$C$2,ROW($B:$B),36500),ROW(D56)))&\"\"","v":""},{"$f":"IF(ISERROR(VALUE(INDEX(信誉提升汇总记录表!E:E,SMALL(IF(信誉提升汇总记录表!$A:$A=$C$2,ROW($B:$B),36500),ROW(E56)))&\"\")),\"\",VALUE(INDEX(信誉提升汇总记录表!E:E,SMALL(IF(信誉提升汇总记录表!$A:$A=$C$2,ROW($B:$B),36500),ROW(E56)))&\"\"))","v":""},{"$f":"INDEX(信誉提升汇总记录表!J:J,SMALL(IF(信誉提升汇总记录表!$A:$A=$C$2,ROW($B:$B),36500),ROW(F56)))&\"\"","v":""},{"$f":"INDEX(信誉提升汇总记录表!K:K,SMALL(IF(信誉提升汇总记录表!$A:$A=$C$2,ROW($B:$B),36500),ROW(G56)))&\"\"","v":""},{"$f":"INDEX(信誉提升汇总记录表!M:M,SMALL(IF(信誉提升汇总记录表!$A:$A=$C$2,ROW($B:$B),36500),ROW(H56)))&\"\"","v":""}]
[{"$f":"IF(B60=\"\",\"\",INDEX(信誉提升汇总记录表!B:B,SMALL(IF(信誉提升汇总记录表!$A:$A=$C$2,ROW($B:$B),36500),ROW(A57))))","v":""},{"$f":"INDEX(信誉提升汇总记录表!A:A,SMALL(IF(信誉提升汇总记录表!$A:$A=$C$2,ROW($B:$B),36500),ROW(B57)))&\"\"","v":""},{"$f":"INDEX(信誉提升汇总记录表!C:C,SMALL(IF(信誉提升汇总记录表!$A:$A=$C$2,ROW($B:$B),36500),ROW(C57)))&\"\"","v":""},{"$f":"INDEX(信誉提升汇总记录表!D:D,SMALL(IF(信誉提升汇总记录表!$A:$A=$C$2,ROW($B:$B),36500),ROW(D57)))&\"\"","v":""},{"$f":"IF(ISERROR(VALUE(INDEX(信誉提升汇总记录表!E:E,SMALL(IF(信誉提升汇总记录表!$A:$A=$C$2,ROW($B:$B),36500),ROW(E57)))&\"\")),\"\",VALUE(INDEX(信誉提升汇总记录表!E:E,SMALL(IF(信誉提升汇总记录表!$A:$A=$C$2,ROW($B:$B),36500),ROW(E57)))&\"\"))","v":""},{"$f":"INDEX(信誉提升汇总记录表!J:J,SMALL(IF(信誉提升汇总记录表!$A:$A=$C$2,ROW($B:$B),36500),ROW(F57)))&\"\"","v":""},{"$f":"INDEX(信誉提升汇总记录表!K:K,SMALL(IF(信誉提升汇总记录表!$A:$A=$C$2,ROW($B:$B),36500),ROW(G57)))&\"\"","v":""},{"$f":"INDEX(信誉提升汇总记录表!M:M,SMALL(IF(信誉提升汇总记录表!$A:$A=$C$2,ROW($B:$B),36500),ROW(H57)))&\"\"","v":""}]
[{"$f":"IF(B61=\"\",\"\",INDEX(信誉提升汇总记录表!B:B,SMALL(IF(信誉提升汇总记录表!$A:$A=$C$2,ROW($B:$B),36500),ROW(A58))))","v":""},{"$f":"INDEX(信誉提升汇总记录表!A:A,SMALL(IF(信誉提升汇总记录表!$A:$A=$C$2,ROW($B:$B),36500),ROW(B58)))&\"\"","v":""},{"$f":"INDEX(信誉提升汇总记录表!C:C,SMALL(IF(信誉提升汇总记录表!$A:$A=$C$2,ROW($B:$B),36500),ROW(C58)))&\"\"","v":""},{"$f":"INDEX(信誉提升汇总记录表!D:D,SMALL(IF(信誉提升汇总记录表!$A:$A=$C$2,ROW($B:$B),36500),ROW(D58)))&\"\"","v":""},{"$f":"IF(ISERROR(VALUE(INDEX(信誉提升汇总记录表!E:E,SMALL(IF(信誉提升汇总记录表!$A:$A=$C$2,ROW($B:$B),36500),ROW(E58)))&\"\")),\"\",VALUE(INDEX(信誉提升汇总记录表!E:E,SMALL(IF(信誉提升汇总记录表!$A:$A=$C$2,ROW($B:$B),36500),ROW(E58)))&\"\"))","v":""},{"$f":"INDEX(信誉提升汇总记录表!J:J,SMALL(IF(信誉提升汇总记录表!$A:$A=$C$2,ROW($B:$B),36500),ROW(F58)))&\"\"","v":""},{"$f":"INDEX(信誉提升汇总记录表!K:K,SMALL(IF(信誉提升汇总记录表!$A:$A=$C$2,ROW($B:$B),36500),ROW(G58)))&\"\"","v":""},{"$f":"INDEX(信誉提升汇总记录表!M:M,SMALL(IF(信誉提升汇总记录表!$A:$A=$C$2,ROW($B:$B),36500),ROW(H58)))&\"\"","v":""}]
[{"$f":"IF(B62=\"\",\"\",INDEX(信誉提升汇总记录表!B:B,SMALL(IF(信誉提升汇总记录表!$A:$A=$C$2,ROW($B:$B),36500),ROW(A59))))","v":""},{"$f":"INDEX(信誉提升汇总记录表!A:A,SMALL(IF(信誉提升汇总记录表!$A:$A=$C$2,ROW($B:$B),36500),ROW(B59)))&\"\"","v":""},{"$f":"INDEX(信誉提升汇总记录表!C:C,SMALL(IF(信誉提升汇总记录表!$A:$A=$C$2,ROW($B:$B),36500),ROW(C59)))&\"\"","v":""},{"$f":"INDEX(信誉提升汇总记录表!D:D,SMALL(IF(信誉提升汇总记录表!$A:$A=$C$2,ROW($B:$B),36500),ROW(D59)))&\"\"","v":""},{"$f":"IF(ISERROR(VALUE(INDEX(信誉提升汇总记录表!E:E,SMALL(IF(信誉提升汇总记录表!$A:$A=$C$2,ROW($B:$B),36500),ROW(E59)))&\"\")),\"\",VALUE(INDEX(信誉提升汇总记录表!E:E,SMALL(IF(信誉提升汇总记录表!$A:$A=$C$2,ROW($B:$B),36500),ROW(E59)))&\"\"))","v":""},{"$f":"INDEX(信誉提升汇总记录表!J:J,SMALL(IF(信誉提升汇总记录表!$A:$A=$C$2,ROW($B:$B),36500),ROW(F59)))&\"\"","v":""},{"$f":"INDEX(信誉提升汇总记录表!K:K,SMALL(IF(信誉提升汇总记录表!$A:$A=$C$2,ROW($B:$B),36500),ROW(G59)))&\"\"","v":""},{"$f":"INDEX(信誉提升汇总记录表!M:M,SMALL(IF(信誉提升汇总记录表!$A:$A=$C$2,ROW($B:$B),36500),ROW(H59)))&\"\"","v":""}]
[{"$f":"IF(B63=\"\",\"\",INDEX(信誉提升汇总记录表!B:B,SMALL(IF(信誉提升汇总记录表!$A:$A=$C$2,ROW($B:$B),36500),ROW(A60))))","v":""},{"$f":"INDEX(信誉提升汇总记录表!A:A,SMALL(IF(信誉提升汇总记录表!$A:$A=$C$2,ROW($B:$B),36500),ROW(B60)))&\"\"","v":""},{"$f":"INDEX(信誉提升汇总记录表!C:C,SMALL(IF(信誉提升汇总记录表!$A:$A=$C$2,ROW($B:$B),36500),ROW(C60)))&\"\"","v":""},{"$f":"INDEX(信誉提升汇总记录表!D:D,SMALL(IF(信誉提升汇总记录表!$A:$A=$C$2,ROW($B:$B),36500),ROW(D60)))&\"\"","v":""},{"$f":"IF(ISERROR(VALUE(INDEX(信誉提升汇总记录表!E:E,SMALL(IF(信誉提升汇总记录表!$A:$A=$C$2,ROW($B:$B),36500),ROW(E60)))&\"\")),\"\",VALUE(INDEX(信誉提升汇总记录表!E:E,SMALL(IF(信誉提升汇总记录表!$A:$A=$C$2,ROW($B:$B),36500),ROW(E60)))&\"\"))","v":""},{"$f":"INDEX(信誉提升汇总记录表!J:J,SMALL(IF(信誉提升汇总记录表!$A:$A=$C$2,ROW($B:$B),36500),ROW(F60)))&\"\"","v":""},{"$f":"INDEX(信誉提升汇总记录表!K:K,SMALL(IF(信誉提升汇总记录表!$A:$A=$C$2,ROW($B:$B),36500),ROW(G60)))&\"\"","v":""},{"$f":"INDEX(信誉提升汇总记录表!M:M,SMALL(IF(信誉提升汇总记录表!$A:$A=$C$2,ROW($B:$B),36500),ROW(H60)))&\"\"","v":""}]
[{"$f":"IF(B64=\"\",\"\",INDEX(信誉提升汇总记录表!B:B,SMALL(IF(信誉提升汇总记录表!$A:$A=$C$2,ROW($B:$B),36500),ROW(A61))))","v":""},{"$f":"INDEX(信誉提升汇总记录表!A:A,SMALL(IF(信誉提升汇总记录表!$A:$A=$C$2,ROW($B:$B),36500),ROW(B61)))&\"\"","v":""},{"$f":"INDEX(信誉提升汇总记录表!C:C,SMALL(IF(信誉提升汇总记录表!$A:$A=$C$2,ROW($B:$B),36500),ROW(C61)))&\"\"","v":""},{"$f":"INDEX(信誉提升汇总记录表!D:D,SMALL(IF(信誉提升汇总记录表!$A:$A=$C$2,ROW($B:$B),36500),ROW(D61)))&\"\"","v":""},{"$f":"IF(ISERROR(VALUE(INDEX(信誉提升汇总记录表!E:E,SMALL(IF(信誉提升汇总记录表!$A:$A=$C$2,ROW($B:$B),36500),ROW(E61)))&\"\")),\"\",VALUE(INDEX(信誉提升汇总记录表!E:E,SMALL(IF(信誉提升汇总记录表!$A:$A=$C$2,ROW($B:$B),36500),ROW(E61)))&\"\"))","v":""},{"$f":"INDEX(信誉提升汇总记录表!J:J,SMALL(IF(信誉提升汇总记录表!$A:$A=$C$2,ROW($B:$B),36500),ROW(F61)))&\"\"","v":""},{"$f":"INDEX(信誉提升汇总记录表!K:K,SMALL(IF(信誉提升汇总记录表!$A:$A=$C$2,ROW($B:$B),36500),ROW(G61)))&\"\"","v":""},{"$f":"INDEX(信誉提升汇总记录表!M:M,SMALL(IF(信誉提升汇总记录表!$A:$A=$C$2,ROW($B:$B),36500),ROW(H61)))&\"\"","v":""}]
[{"$f":"IF(B65=\"\",\"\",INDEX(信誉提升汇总记录表!B:B,SMALL(IF(信誉提升汇总记录表!$A:$A=$C$2,ROW($B:$B),36500),ROW(A62))))","v":""},{"$f":"INDEX(信誉提升汇总记录表!A:A,SMALL(IF(信誉提升汇总记录表!$A:$A=$C$2,ROW($B:$B),36500),ROW(B62)))&\"\"","v":""},{"$f":"INDEX(信誉提升汇总记录表!C:C,SMALL(IF(信誉提升汇总记录表!$A:$A=$C$2,ROW($B:$B),36500),ROW(C62)))&\"\"","v":""},{"$f":"INDEX(信誉提升汇总记录表!D:D,SMALL(IF(信誉提升汇总记录表!$A:$A=$C$2,ROW($B:$B),36500),ROW(D62)))&\"\"","v":""},{"$f":"IF(ISERROR(VALUE(INDEX(信誉提升汇总记录表!E:E,SMALL(IF(信誉提升汇总记录表!$A:$A=$C$2,ROW($B:$B),36500),ROW(E62)))&\"\")),\"\",VALUE(INDEX(信誉提升汇总记录表!E:E,SMALL(IF(信誉提升汇总记录表!$A:$A=$C$2,ROW($B:$B),36500),ROW(E62)))&\"\"))","v":""},{"$f":"INDEX(信誉提升汇总记录表!J:J,SMALL(IF(信誉提升汇总记录表!$A:$A=$C$2,ROW($B:$B),36500),ROW(F62)))&\"\"","v":""},{"$f":"INDEX(信誉提升汇总记录表!K:K,SMALL(IF(信誉提升汇总记录表!$A:$A=$C$2,ROW($B:$B),36500),ROW(G62)))&\"\"","v":""},{"$f":"INDEX(信誉提升汇总记录表!M:M,SMALL(IF(信誉提升汇总记录表!$A:$A=$C$2,ROW($B:$B),36500),ROW(H62)))&\"\"","v":""}]
[{"$f":"IF(B66=\"\",\"\",INDEX(信誉提升汇总记录表!B:B,SMALL(IF(信誉提升汇总记录表!$A:$A=$C$2,ROW($B:$B),36500),ROW(A63))))","v":""},{"$f":"INDEX(信誉提升汇总记录表!A:A,SMALL(IF(信誉提升汇总记录表!$A:$A=$C$2,ROW($B:$B),36500),ROW(B63)))&\"\"","v":""},{"$f":"INDEX(信誉提升汇总记录表!C:C,SMALL(IF(信誉提升汇总记录表!$A:$A=$C$2,ROW($B:$B),36500),ROW(C63)))&\"\"","v":""},{"$f":"INDEX(信誉提升汇总记录表!D:D,SMALL(IF(信誉提升汇总记录表!$A:$A=$C$2,ROW($B:$B),36500),ROW(D63)))&\"\"","v":""},{"$f":"IF(ISERROR(VALUE(INDEX(信誉提升汇总记录表!E:E,SMALL(IF(信誉提升汇总记录表!$A:$A=$C$2,ROW($B:$B),36500),ROW(E63)))&\"\")),\"\",VALUE(INDEX(信誉提升汇总记录表!E:E,SMALL(IF(信誉提升汇总记录表!$A:$A=$C$2,ROW($B:$B),36500),ROW(E63)))&\"\"))","v":""},{"$f":"INDEX(信誉提升汇总记录表!J:J,SMALL(IF(信誉提升汇总记录表!$A:$A=$C$2,ROW($B:$B),36500),ROW(F63)))&\"\"","v":""},{"$f":"INDEX(信誉提升汇总记录表!K:K,SMALL(IF(信誉提升汇总记录表!$A:$A=$C$2,ROW($B:$B),36500),ROW(G63)))&\"\"","v":""},{"$f":"INDEX(信誉提升汇总记录表!M:M,SMALL(IF(信誉提升汇总记录表!$A:$A=$C$2,ROW($B:$B),36500),ROW(H63)))&\"\"","v":""}]
[{"$f":"IF(B67=\"\",\"\",INDEX(信誉提升汇总记录表!B:B,SMALL(IF(信誉提升汇总记录表!$A:$A=$C$2,ROW($B:$B),36500),ROW(A64))))","v":""},{"$f":"INDEX(信誉提升汇总记录表!A:A,SMALL(IF(信誉提升汇总记录表!$A:$A=$C$2,ROW($B:$B),36500),ROW(B64)))&\"\"","v":""},{"$f":"INDEX(信誉提升汇总记录表!C:C,SMALL(IF(信誉提升汇总记录表!$A:$A=$C$2,ROW($B:$B),36500),ROW(C64)))&\"\"","v":""},{"$f":"INDEX(信誉提升汇总记录表!D:D,SMALL(IF(信誉提升汇总记录表!$A:$A=$C$2,ROW($B:$B),36500),ROW(D64)))&\"\"","v":""},{"$f":"IF(ISERROR(VALUE(INDEX(信誉提升汇总记录表!E:E,SMALL(IF(信誉提升汇总记录表!$A:$A=$C$2,ROW($B:$B),36500),ROW(E64)))&\"\")),\"\",VALUE(INDEX(信誉提升汇总记录表!E:E,SMALL(IF(信誉提升汇总记录表!$A:$A=$C$2,ROW($B:$B),36500),ROW(E64)))&\"\"))","v":""},{"$f":"INDEX(信誉提升汇总记录表!J:J,SMALL(IF(信誉提升汇总记录表!$A:$A=$C$2,ROW($B:$B),36500),ROW(F64)))&\"\"","v":""},{"$f":"INDEX(信誉提升汇总记录表!K:K,SMALL(IF(信誉提升汇总记录表!$A:$A=$C$2,ROW($B:$B),36500),ROW(G64)))&\"\"","v":""},{"$f":"INDEX(信誉提升汇总记录表!M:M,SMALL(IF(信誉提升汇总记录表!$A:$A=$C$2,ROW($B:$B),36500),ROW(H64)))&\"\"","v":""}]
[{"$f":"IF(B68=\"\",\"\",INDEX(信誉提升汇总记录表!B:B,SMALL(IF(信誉提升汇总记录表!$A:$A=$C$2,ROW($B:$B),36500),ROW(A65))))","v":""},{"$f":"INDEX(信誉提升汇总记录表!A:A,SMALL(IF(信誉提升汇总记录表!$A:$A=$C$2,ROW($B:$B),36500),ROW(B65)))&\"\"","v":""},{"$f":"INDEX(信誉提升汇总记录表!C:C,SMALL(IF(信誉提升汇总记录表!$A:$A=$C$2,ROW($B:$B),36500),ROW(C65)))&\"\"","v":""},{"$f":"INDEX(信誉提升汇总记录表!D:D,SMALL(IF(信誉提升汇总记录表!$A:$A=$C$2,ROW($B:$B),36500),ROW(D65)))&\"\"","v":""},{"$f":"IF(ISERROR(VALUE(INDEX(信誉提升汇总记录表!E:E,SMALL(IF(信誉提升汇总记录表!$A:$A=$C$2,ROW($B:$B),36500),ROW(E65)))&\"\")),\"\",VALUE(INDEX(信誉提升汇总记录表!E:E,SMALL(IF(信誉提升汇总记录表!$A:$A=$C$2,ROW($B:$B),36500),ROW(E65)))&\"\"))","v":""},{"$f":"INDEX(信誉提升汇总记录表!J:J,SMALL(IF(信誉提升汇总记录表!$A:$A=$C$2,ROW($B:$B),36500),ROW(F65)))&\"\"","v":""},{"$f":"INDEX(信誉提升汇总记录表!K:K,SMALL(IF(信誉提升汇总记录表!$A:$A=$C$2,ROW($B:$B),36500),ROW(G65)))&\"\"","v":""},{"$f":"INDEX(信誉提升汇总记录表!M:M,SMALL(IF(信誉提升汇总记录表!$A:$A=$C$2,ROW($B:$B),36500),ROW(H65)))&\"\"","v":""}]
[{"$f":"IF(B69=\"\",\"\",INDEX(信誉提升汇总记录表!B:B,SMALL(IF(信誉提升汇总记录表!$A:$A=$C$2,ROW($B:$B),36500),ROW(A66))))","v":""},{"$f":"INDEX(信誉提升汇总记录表!A:A,SMALL(IF(信誉提升汇总记录表!$A:$A=$C$2,ROW($B:$B),36500),ROW(B66)))&\"\"","v":""},{"$f":"INDEX(信誉提升汇总记录表!C:C,SMALL(IF(信誉提升汇总记录表!$A:$A=$C$2,ROW($B:$B),36500),ROW(C66)))&\"\"","v":""},{"$f":"INDEX(信誉提升汇总记录表!D:D,SMALL(IF(信誉提升汇总记录表!$A:$A=$C$2,ROW($B:$B),36500),ROW(D66)))&\"\"","v":""},{"$f":"IF(ISERROR(VALUE(INDEX(信誉提升汇总记录表!E:E,SMALL(IF(信誉提升汇总记录表!$A:$A=$C$2,ROW($B:$B),36500),ROW(E66)))&\"\")),\"\",VALUE(INDEX(信誉提升汇总记录表!E:E,SMALL(IF(信誉提升汇总记录表!$A:$A=$C$2,ROW($B:$B),36500),ROW(E66)))&\"\"))","v":""},{"$f":"INDEX(信誉提升汇总记录表!J:J,SMALL(IF(信誉提升汇总记录表!$A:$A=$C$2,ROW($B:$B),36500),ROW(F66)))&\"\"","v":""},{"$f":"INDEX(信誉提升汇总记录表!K:K,SMALL(IF(信誉提升汇总记录表!$A:$A=$C$2,ROW($B:$B),36500),ROW(G66)))&\"\"","v":""},{"$f":"INDEX(信誉提升汇总记录表!M:M,SMALL(IF(信誉提升汇总记录表!$A:$A=$C$2,ROW($B:$B),36500),ROW(H66)))&\"\"","v":""}]
[{"$f":"IF(B70=\"\",\"\",INDEX(信誉提升汇总记录表!B:B,SMALL(IF(信誉提升汇总记录表!$A:$A=$C$2,ROW($B:$B),36500),ROW(A67))))","v":""},{"$f":"INDEX(信誉提升汇总记录表!A:A,SMALL(IF(信誉提升汇总记录表!$A:$A=$C$2,ROW($B:$B),36500),ROW(B67)))&\"\"","v":""},{"$f":"INDEX(信誉提升汇总记录表!C:C,SMALL(IF(信誉提升汇总记录表!$A:$A=$C$2,ROW($B:$B),36500),ROW(C67)))&\"\"","v":""},{"$f":"INDEX(信誉提升汇总记录表!D:D,SMALL(IF(信誉提升汇总记录表!$A:$A=$C$2,ROW($B:$B),36500),ROW(D67)))&\"\"","v":""},{"$f":"IF(ISERROR(VALUE(INDEX(信誉提升汇总记录表!E:E,SMALL(IF(信誉提升汇总记录表!$A:$A=$C$2,ROW($B:$B),36500),ROW(E67)))&\"\")),\"\",VALUE(INDEX(信誉提升汇总记录表!E:E,SMALL(IF(信誉提升汇总记录表!$A:$A=$C$2,ROW($B:$B),36500),ROW(E67)))&\"\"))","v":""},{"$f":"INDEX(信誉提升汇总记录表!J:J,SMALL(IF(信誉提升汇总记录表!$A:$A=$C$2,ROW($B:$B),36500),ROW(F67)))&\"\"","v":""},{"$f":"INDEX(信誉提升汇总记录表!K:K,SMALL(IF(信誉提升汇总记录表!$A:$A=$C$2,ROW($B:$B),36500),ROW(G67)))&\"\"","v":""},{"$f":"INDEX(信誉提升汇总记录表!M:M,SMALL(IF(信誉提升汇总记录表!$A:$A=$C$2,ROW($B:$B),36500),ROW(H67)))&\"\"","v":""}]
[{"$f":"IF(B71=\"\",\"\",INDEX(信誉提升汇总记录表!B:B,SMALL(IF(信誉提升汇总记录表!$A:$A=$C$2,ROW($B:$B),36500),ROW(A68))))","v":""},{"$f":"INDEX(信誉提升汇总记录表!A:A,SMALL(IF(信誉提升汇总记录表!$A:$A=$C$2,ROW($B:$B),36500),ROW(B68)))&\"\"","v":""},{"$f":"INDEX(信誉提升汇总记录表!C:C,SMALL(IF(信誉提升汇总记录表!$A:$A=$C$2,ROW($B:$B),36500),ROW(C68)))&\"\"","v":""},{"$f":"INDEX(信誉提升汇总记录表!D:D,SMALL(IF(信誉提升汇总记录表!$A:$A=$C$2,ROW($B:$B),36500),ROW(D68)))&\"\"","v":""},{"$f":"IF(ISERROR(VALUE(INDEX(信誉提升汇总记录表!E:E,SMALL(IF(信誉提升汇总记录表!$A:$A=$C$2,ROW($B:$B),36500),ROW(E68)))&\"\")),\"\",VALUE(INDEX(信誉提升汇总记录表!E:E,SMALL(IF(信誉提升汇总记录表!$A:$A=$C$2,ROW($B:$B),36500),ROW(E68)))&\"\"))","v":""},{"$f":"INDEX(信誉提升汇总记录表!J:J,SMALL(IF(信誉提升汇总记录表!$A:$A=$C$2,ROW($B:$B),36500),ROW(F68)))&\"\"","v":""},{"$f":"INDEX(信誉提升汇总记录表!K:K,SMALL(IF(信誉提升汇总记录表!$A:$A=$C$2,ROW($B:$B),36500),ROW(G68)))&\"\"","v":""},{"$f":"INDEX(信誉提升汇总记录表!M:M,SMALL(IF(信誉提升汇总记录表!$A:$A=$C$2,ROW($B:$B),36500),ROW(H68)))&\"\"","v":""}]
[{"$f":"IF(B72=\"\",\"\",INDEX(信誉提升汇总记录表!B:B,SMALL(IF(信誉提升汇总记录表!$A:$A=$C$2,ROW($B:$B),36500),ROW(A69))))","v":""},{"$f":"INDEX(信誉提升汇总记录表!A:A,SMALL(IF(信誉提升汇总记录表!$A:$A=$C$2,ROW($B:$B),36500),ROW(B69)))&\"\"","v":""},{"$f":"INDEX(信誉提升汇总记录表!C:C,SMALL(IF(信誉提升汇总记录表!$A:$A=$C$2,ROW($B:$B),36500),ROW(C69)))&\"\"","v":""},{"$f":"INDEX(信誉提升汇总记录表!D:D,SMALL(IF(信誉提升汇总记录表!$A:$A=$C$2,ROW($B:$B),36500),ROW(D69)))&\"\"","v":""},{"$f":"IF(ISERROR(VALUE(INDEX(信誉提升汇总记录表!E:E,SMALL(IF(信誉提升汇总记录表!$A:$A=$C$2,ROW($B:$B),36500),ROW(E69)))&\"\")),\"\",VALUE(INDEX(信誉提升汇总记录表!E:E,SMALL(IF(信誉提升汇总记录表!$A:$A=$C$2,ROW($B:$B),36500),ROW(E69)))&\"\"))","v":""},{"$f":"INDEX(信誉提升汇总记录表!J:J,SMALL(IF(信誉提升汇总记录表!$A:$A=$C$2,ROW($B:$B),36500),ROW(F69)))&\"\"","v":""},{"$f":"INDEX(信誉提升汇总记录表!K:K,SMALL(IF(信誉提升汇总记录表!$A:$A=$C$2,ROW($B:$B),36500),ROW(G69)))&\"\"","v":""},{"$f":"INDEX(信誉提升汇总记录表!M:M,SMALL(IF(信誉提升汇总记录表!$A:$A=$C$2,ROW($B:$B),36500),ROW(H69)))&\"\"","v":""}]
[{"$f":"IF(B73=\"\",\"\",INDEX(信誉提升汇总记录表!B:B,SMALL(IF(信誉提升汇总记录表!$A:$A=$C$2,ROW($B:$B),36500),ROW(A70))))","v":""},{"$f":"INDEX(信誉提升汇总记录表!A:A,SMALL(IF(信誉提升汇总记录表!$A:$A=$C$2,ROW($B:$B),36500),ROW(B70)))&\"\"","v":""},{"$f":"INDEX(信誉提升汇总记录表!C:C,SMALL(IF(信誉提升汇总记录表!$A:$A=$C$2,ROW($B:$B),36500),ROW(C70)))&\"\"","v":""},{"$f":"INDEX(信誉提升汇总记录表!D:D,SMALL(IF(信誉提升汇总记录表!$A:$A=$C$2,ROW($B:$B),36500),ROW(D70)))&\"\"","v":""},{"$f":"IF(ISERROR(VALUE(INDEX(信誉提升汇总记录表!E:E,SMALL(IF(信誉提升汇总记录表!$A:$A=$C$2,ROW($B:$B),36500),ROW(E70)))&\"\")),\"\",VALUE(INDEX(信誉提升汇总记录表!E:E,SMALL(IF(信誉提升汇总记录表!$A:$A=$C$2,ROW($B:$B),36500),ROW(E70)))&\"\"))","v":""},{"$f":"INDEX(信誉提升汇总记录表!J:J,SMALL(IF(信誉提升汇总记录表!$A:$A=$C$2,ROW($B:$B),36500),ROW(F70)))&\"\"","v":""},{"$f":"INDEX(信誉提升汇总记录表!K:K,SMALL(IF(信誉提升汇总记录表!$A:$A=$C$2,ROW($B:$B),36500),ROW(G70)))&\"\"","v":""},{"$f":"INDEX(信誉提升汇总记录表!M:M,SMALL(IF(信誉提升汇总记录表!$A:$A=$C$2,ROW($B:$B),36500),ROW(H70)))&\"\"","v":""}]
[{"$f":"IF(B74=\"\",\"\",INDEX(信誉提升汇总记录表!B:B,SMALL(IF(信誉提升汇总记录表!$A:$A=$C$2,ROW($B:$B),36500),ROW(A71))))","v":""},{"$f":"INDEX(信誉提升汇总记录表!A:A,SMALL(IF(信誉提升汇总记录表!$A:$A=$C$2,ROW($B:$B),36500),ROW(B71)))&\"\"","v":""},{"$f":"INDEX(信誉提升汇总记录表!C:C,SMALL(IF(信誉提升汇总记录表!$A:$A=$C$2,ROW($B:$B),36500),ROW(C71)))&\"\"","v":""},{"$f":"INDEX(信誉提升汇总记录表!D:D,SMALL(IF(信誉提升汇总记录表!$A:$A=$C$2,ROW($B:$B),36500),ROW(D71)))&\"\"","v":""},{"$f":"IF(ISERROR(VALUE(INDEX(信誉提升汇总记录表!E:E,SMALL(IF(信誉提升汇总记录表!$A:$A=$C$2,ROW($B:$B),36500),ROW(E71)))&\"\")),\"\",VALUE(INDEX(信誉提升汇总记录表!E:E,SMALL(IF(信誉提升汇总记录表!$A:$A=$C$2,ROW($B:$B),36500),ROW(E71)))&\"\"))","v":""},{"$f":"INDEX(信誉提升汇总记录表!J:J,SMALL(IF(信誉提升汇总记录表!$A:$A=$C$2,ROW($B:$B),36500),ROW(F71)))&\"\"","v":""},{"$f":"INDEX(信誉提升汇总记录表!K:K,SMALL(IF(信誉提升汇总记录表!$A:$A=$C$2,ROW($B:$B),36500),ROW(G71)))&\"\"","v":""},{"$f":"INDEX(信誉提升汇总记录表!M:M,SMALL(IF(信誉提升汇总记录表!$A:$A=$C$2,ROW($B:$B),36500),ROW(H71)))&\"\"","v":""}]
[{"$f":"IF(B75=\"\",\"\",INDEX(信誉提升汇总记录表!B:B,SMALL(IF(信誉提升汇总记录表!$A:$A=$C$2,ROW($B:$B),36500),ROW(A72))))","v":""},{"$f":"INDEX(信誉提升汇总记录表!A:A,SMALL(IF(信誉提升汇总记录表!$A:$A=$C$2,ROW($B:$B),36500),ROW(B72)))&\"\"","v":""},{"$f":"INDEX(信誉提升汇总记录表!C:C,SMALL(IF(信誉提升汇总记录表!$A:$A=$C$2,ROW($B:$B),36500),ROW(C72)))&\"\"","v":""},{"$f":"INDEX(信誉提升汇总记录表!D:D,SMALL(IF(信誉提升汇总记录表!$A:$A=$C$2,ROW($B:$B),36500),ROW(D72)))&\"\"","v":""},{"$f":"IF(ISERROR(VALUE(INDEX(信誉提升汇总记录表!E:E,SMALL(IF(信誉提升汇总记录表!$A:$A=$C$2,ROW($B:$B),36500),ROW(E72)))&\"\")),\"\",VALUE(INDEX(信誉提升汇总记录表!E:E,SMALL(IF(信誉提升汇总记录表!$A:$A=$C$2,ROW($B:$B),36500),ROW(E72)))&\"\"))","v":""},{"$f":"INDEX(信誉提升汇总记录表!J:J,SMALL(IF(信誉提升汇总记录表!$A:$A=$C$2,ROW($B:$B),36500),ROW(F72)))&\"\"","v":""},{"$f":"INDEX(信誉提升汇总记录表!K:K,SMALL(IF(信誉提升汇总记录表!$A:$A=$C$2,ROW($B:$B),36500),ROW(G72)))&\"\"","v":""},{"$f":"INDEX(信誉提升汇总记录表!M:M,SMALL(IF(信誉提升汇总记录表!$A:$A=$C$2,ROW($B:$B),36500),ROW(H72)))&\"\"","v":""}]
[{"$f":"IF(B76=\"\",\"\",INDEX(信誉提升汇总记录表!B:B,SMALL(IF(信誉提升汇总记录表!$A:$A=$C$2,ROW($B:$B),36500),ROW(A73))))","v":""},{"$f":"INDEX(信誉提升汇总记录表!A:A,SMALL(IF(信誉提升汇总记录表!$A:$A=$C$2,ROW($B:$B),36500),ROW(B73)))&\"\"","v":""},{"$f":"INDEX(信誉提升汇总记录表!C:C,SMALL(IF(信誉提升汇总记录表!$A:$A=$C$2,ROW($B:$B),36500),ROW(C73)))&\"\"","v":""},{"$f":"INDEX(信誉提升汇总记录表!D:D,SMALL(IF(信誉提升汇总记录表!$A:$A=$C$2,ROW($B:$B),36500),ROW(D73)))&\"\"","v":""},{"$f":"IF(ISERROR(VALUE(INDEX(信誉提升汇总记录表!E:E,SMALL(IF(信誉提升汇总记录表!$A:$A=$C$2,ROW($B:$B),36500),ROW(E73)))&\"\")),\"\",VALUE(INDEX(信誉提升汇总记录表!E:E,SMALL(IF(信誉提升汇总记录表!$A:$A=$C$2,ROW($B:$B),36500),ROW(E73)))&\"\"))","v":""},{"$f":"INDEX(信誉提升汇总记录表!J:J,SMALL(IF(信誉提升汇总记录表!$A:$A=$C$2,ROW($B:$B),36500),ROW(F73)))&\"\"","v":""},{"$f":"INDEX(信誉提升汇总记录表!K:K,SMALL(IF(信誉提升汇总记录表!$A:$A=$C$2,ROW($B:$B),36500),ROW(G73)))&\"\"","v":""},{"$f":"INDEX(信誉提升汇总记录表!M:M,SMALL(IF(信誉提升汇总记录表!$A:$A=$C$2,ROW($B:$B),36500),ROW(H73)))&\"\"","v":""}]
[{"$f":"IF(B77=\"\",\"\",INDEX(信誉提升汇总记录表!B:B,SMALL(IF(信誉提升汇总记录表!$A:$A=$C$2,ROW($B:$B),36500),ROW(A74))))","v":""},{"$f":"INDEX(信誉提升汇总记录表!A:A,SMALL(IF(信誉提升汇总记录表!$A:$A=$C$2,ROW($B:$B),36500),ROW(B74)))&\"\"","v":""},{"$f":"INDEX(信誉提升汇总记录表!C:C,SMALL(IF(信誉提升汇总记录表!$A:$A=$C$2,ROW($B:$B),36500),ROW(C74)))&\"\"","v":""},{"$f":"INDEX(信誉提升汇总记录表!D:D,SMALL(IF(信誉提升汇总记录表!$A:$A=$C$2,ROW($B:$B),36500),ROW(D74)))&\"\"","v":""},{"$f":"IF(ISERROR(VALUE(INDEX(信誉提升汇总记录表!E:E,SMALL(IF(信誉提升汇总记录表!$A:$A=$C$2,ROW($B:$B),36500),ROW(E74)))&\"\")),\"\",VALUE(INDEX(信誉提升汇总记录表!E:E,SMALL(IF(信誉提升汇总记录表!$A:$A=$C$2,ROW($B:$B),36500),ROW(E74)))&\"\"))","v":""},{"$f":"INDEX(信誉提升汇总记录表!J:J,SMALL(IF(信誉提升汇总记录表!$A:$A=$C$2,ROW($B:$B),36500),ROW(F74)))&\"\"","v":""},{"$f":"INDEX(信誉提升汇总记录表!K:K,SMALL(IF(信誉提升汇总记录表!$A:$A=$C$2,ROW($B:$B),36500),ROW(G74)))&\"\"","v":""},{"$f":"INDEX(信誉提升汇总记录表!M:M,SMALL(IF(信誉提升汇总记录表!$A:$A=$C$2,ROW($B:$B),36500),ROW(H74)))&\"\"","v":""}]
[{"$f":"IF(B78=\"\",\"\",INDEX(信誉提升汇总记录表!B:B,SMALL(IF(信誉提升汇总记录表!$A:$A=$C$2,ROW($B:$B),36500),ROW(A75))))","v":""},{"$f":"INDEX(信誉提升汇总记录表!A:A,SMALL(IF(信誉提升汇总记录表!$A:$A=$C$2,ROW($B:$B),36500),ROW(B75)))&\"\"","v":""},{"$f":"INDEX(信誉提升汇总记录表!C:C,SMALL(IF(信誉提升汇总记录表!$A:$A=$C$2,ROW($B:$B),36500),ROW(C75)))&\"\"","v":""},{"$f":"INDEX(信誉提升汇总记录表!D:D,SMALL(IF(信誉提升汇总记录表!$A:$A=$C$2,ROW($B:$B),36500),ROW(D75)))&\"\"","v":""},{"$f":"IF(ISERROR(VALUE(INDEX(信誉提升汇总记录表!E:E,SMALL(IF(信誉提升汇总记录表!$A:$A=$C$2,ROW($B:$B),36500),ROW(E75)))&\"\")),\"\",VALUE(INDEX(信誉提升汇总记录表!E:E,SMALL(IF(信誉提升汇总记录表!$A:$A=$C$2,ROW($B:$B),36500),ROW(E75)))&\"\"))","v":""},{"$f":"INDEX(信誉提升汇总记录表!J:J,SMALL(IF(信誉提升汇总记录表!$A:$A=$C$2,ROW($B:$B),36500),ROW(F75)))&\"\"","v":""},{"$f":"INDEX(信誉提升汇总记录表!K:K,SMALL(IF(信誉提升汇总记录表!$A:$A=$C$2,ROW($B:$B),36500),ROW(G75)))&\"\"","v":""},{"$f":"INDEX(信誉提升汇总记录表!M:M,SMALL(IF(信誉提升汇总记录表!$A:$A=$C$2,ROW($B:$B),36500),ROW(H75)))&\"\"","v":""}]
[{"$f":"IF(B79=\"\",\"\",INDEX(信誉提升汇总记录表!B:B,SMALL(IF(信誉提升汇总记录表!$A:$A=$C$2,ROW($B:$B),36500),ROW(A76))))","v":""},{"$f":"INDEX(信誉提升汇总记录表!A:A,SMALL(IF(信誉提升汇总记录表!$A:$A=$C$2,ROW($B:$B),36500),ROW(B76)))&\"\"","v":""},{"$f":"INDEX(信誉提升汇总记录表!C:C,SMALL(IF(信誉提升汇总记录表!$A:$A=$C$2,ROW($B:$B),36500),ROW(C76)))&\"\"","v":""},{"$f":"INDEX(信誉提升汇总记录表!D:D,SMALL(IF(信誉提升汇总记录表!$A:$A=$C$2,ROW($B:$B),36500),ROW(D76)))&\"\"","v":""},{"$f":"IF(ISERROR(VALUE(INDEX(信誉提升汇总记录表!E:E,SMALL(IF(信誉提升汇总记录表!$A:$A=$C$2,ROW($B:$B),36500),ROW(E76)))&\"\")),\"\",VALUE(INDEX(信誉提升汇总记录表!E:E,SMALL(IF(信誉提升汇总记录表!$A:$A=$C$2,ROW($B:$B),36500),ROW(E76)))&\"\"))","v":""},{"$f":"INDEX(信誉提升汇总记录表!J:J,SMALL(IF(信誉提升汇总记录表!$A:$A=$C$2,ROW($B:$B),36500),ROW(F76)))&\"\"","v":""},{"$f":"INDEX(信誉提升汇总记录表!K:K,SMALL(IF(信誉提升汇总记录表!$A:$A=$C$2,ROW($B:$B),36500),ROW(G76)))&\"\"","v":""},{"$f":"INDEX(信誉提升汇总记录表!M:M,SMALL(IF(信誉提升汇总记录表!$A:$A=$C$2,ROW($B:$B),36500),ROW(H76)))&\"\"","v":""}]
[{"$f":"IF(B80=\"\",\"\",INDEX(信誉提升汇总记录表!B:B,SMALL(IF(信誉提升汇总记录表!$A:$A=$C$2,ROW($B:$B),36500),ROW(A77))))","v":""},{"$f":"INDEX(信誉提升汇总记录表!A:A,SMALL(IF(信誉提升汇总记录表!$A:$A=$C$2,ROW($B:$B),36500),ROW(B77)))&\"\"","v":""},{"$f":"INDEX(信誉提升汇总记录表!C:C,SMALL(IF(信誉提升汇总记录表!$A:$A=$C$2,ROW($B:$B),36500),ROW(C77)))&\"\"","v":""},{"$f":"INDEX(信誉提升汇总记录表!D:D,SMALL(IF(信誉提升汇总记录表!$A:$A=$C$2,ROW($B:$B),36500),ROW(D77)))&\"\"","v":""},{"$f":"IF(ISERROR(VALUE(INDEX(信誉提升汇总记录表!E:E,SMALL(IF(信誉提升汇总记录表!$A:$A=$C$2,ROW($B:$B),36500),ROW(E77)))&\"\")),\"\",VALUE(INDEX(信誉提升汇总记录表!E:E,SMALL(IF(信誉提升汇总记录表!$A:$A=$C$2,ROW($B:$B),36500),ROW(E77)))&\"\"))","v":""},{"$f":"INDEX(信誉提升汇总记录表!J:J,SMALL(IF(信誉提升汇总记录表!$A:$A=$C$2,ROW($B:$B),36500),ROW(F77)))&\"\"","v":""},{"$f":"INDEX(信誉提升汇总记录表!K:K,SMALL(IF(信誉提升汇总记录表!$A:$A=$C$2,ROW($B:$B),36500),ROW(G77)))&\"\"","v":""},{"$f":"INDEX(信誉提升汇总记录表!M:M,SMALL(IF(信誉提升汇总记录表!$A:$A=$C$2,ROW($B:$B),36500),ROW(H77)))&\"\"","v":""}]
[{"$f":"IF(B81=\"\",\"\",INDEX(信誉提升汇总记录表!B:B,SMALL(IF(信誉提升汇总记录表!$A:$A=$C$2,ROW($B:$B),36500),ROW(A78))))","v":""},{"$f":"INDEX(信誉提升汇总记录表!A:A,SMALL(IF(信誉提升汇总记录表!$A:$A=$C$2,ROW($B:$B),36500),ROW(B78)))&\"\"","v":""},{"$f":"INDEX(信誉提升汇总记录表!C:C,SMALL(IF(信誉提升汇总记录表!$A:$A=$C$2,ROW($B:$B),36500),ROW(C78)))&\"\"","v":""},{"$f":"INDEX(信誉提升汇总记录表!D:D,SMALL(IF(信誉提升汇总记录表!$A:$A=$C$2,ROW($B:$B),36500),ROW(D78)))&\"\"","v":""},{"$f":"IF(ISERROR(VALUE(INDEX(信誉提升汇总记录表!E:E,SMALL(IF(信誉提升汇总记录表!$A:$A=$C$2,ROW($B:$B),36500),ROW(E78)))&\"\")),\"\",VALUE(INDEX(信誉提升汇总记录表!E:E,SMALL(IF(信誉提升汇总记录表!$A:$A=$C$2,ROW($B:$B),36500),ROW(E78)))&\"\"))","v":""},{"$f":"INDEX(信誉提升汇总记录表!J:J,SMALL(IF(信誉提升汇总记录表!$A:$A=$C$2,ROW($B:$B),36500),ROW(F78)))&\"\"","v":""},{"$f":"INDEX(信誉提升汇总记录表!K:K,SMALL(IF(信誉提升汇总记录表!$A:$A=$C$2,ROW($B:$B),36500),ROW(G78)))&\"\"","v":""},{"$f":"INDEX(信誉提升汇总记录表!M:M,SMALL(IF(信誉提升汇总记录表!$A:$A=$C$2,ROW($B:$B),36500),ROW(H78)))&\"\"","v":""}]
[{"$f":"IF(B82=\"\",\"\",INDEX(信誉提升汇总记录表!B:B,SMALL(IF(信誉提升汇总记录表!$A:$A=$C$2,ROW($B:$B),36500),ROW(A79))))","v":""},{"$f":"INDEX(信誉提升汇总记录表!A:A,SMALL(IF(信誉提升汇总记录表!$A:$A=$C$2,ROW($B:$B),36500),ROW(B79)))&\"\"","v":""},{"$f":"INDEX(信誉提升汇总记录表!C:C,SMALL(IF(信誉提升汇总记录表!$A:$A=$C$2,ROW($B:$B),36500),ROW(C79)))&\"\"","v":""},{"$f":"INDEX(信誉提升汇总记录表!D:D,SMALL(IF(信誉提升汇总记录表!$A:$A=$C$2,ROW($B:$B),36500),ROW(D79)))&\"\"","v":""},{"$f":"IF(ISERROR(VALUE(INDEX(信誉提升汇总记录表!E:E,SMALL(IF(信誉提升汇总记录表!$A:$A=$C$2,ROW($B:$B),36500),ROW(E79)))&\"\")),\"\",VALUE(INDEX(信誉提升汇总记录表!E:E,SMALL(IF(信誉提升汇总记录表!$A:$A=$C$2,ROW($B:$B),36500),ROW(E79)))&\"\"))","v":""},{"$f":"INDEX(信誉提升汇总记录表!J:J,SMALL(IF(信誉提升汇总记录表!$A:$A=$C$2,ROW($B:$B),36500),ROW(F79)))&\"\"","v":""},{"$f":"INDEX(信誉提升汇总记录表!K:K,SMALL(IF(信誉提升汇总记录表!$A:$A=$C$2,ROW($B:$B),36500),ROW(G79)))&\"\"","v":""},{"$f":"INDEX(信誉提升汇总记录表!M:M,SMALL(IF(信誉提升汇总记录表!$A:$A=$C$2,ROW($B:$B),36500),ROW(H79)))&\"\"","v":""}]
[{"$f":"IF(B83=\"\",\"\",INDEX(信誉提升汇总记录表!B:B,SMALL(IF(信誉提升汇总记录表!$A:$A=$C$2,ROW($B:$B),36500),ROW(A80))))","v":""},{"$f":"INDEX(信誉提升汇总记录表!A:A,SMALL(IF(信誉提升汇总记录表!$A:$A=$C$2,ROW($B:$B),36500),ROW(B80)))&\"\"","v":""},{"$f":"INDEX(信誉提升汇总记录表!C:C,SMALL(IF(信誉提升汇总记录表!$A:$A=$C$2,ROW($B:$B),36500),ROW(C80)))&\"\"","v":""},{"$f":"INDEX(信誉提升汇总记录表!D:D,SMALL(IF(信誉提升汇总记录表!$A:$A=$C$2,ROW($B:$B),36500),ROW(D80)))&\"\"","v":""},{"$f":"IF(ISERROR(VALUE(INDEX(信誉提升汇总记录表!E:E,SMALL(IF(信誉提升汇总记录表!$A:$A=$C$2,ROW($B:$B),36500),ROW(E80)))&\"\")),\"\",VALUE(INDEX(信誉提升汇总记录表!E:E,SMALL(IF(信誉提升汇总记录表!$A:$A=$C$2,ROW($B:$B),36500),ROW(E80)))&\"\"))","v":""},{"$f":"INDEX(信誉提升汇总记录表!J:J,SMALL(IF(信誉提升汇总记录表!$A:$A=$C$2,ROW($B:$B),36500),ROW(F80)))&\"\"","v":""},{"$f":"INDEX(信誉提升汇总记录表!K:K,SMALL(IF(信誉提升汇总记录表!$A:$A=$C$2,ROW($B:$B),36500),ROW(G80)))&\"\"","v":""},{"$f":"INDEX(信誉提升汇总记录表!M:M,SMALL(IF(信誉提升汇总记录表!$A:$A=$C$2,ROW($B:$B),36500),ROW(H80)))&\"\"","v":""}]
[{"$f":"IF(B84=\"\",\"\",INDEX(信誉提升汇总记录表!B:B,SMALL(IF(信誉提升汇总记录表!$A:$A=$C$2,ROW($B:$B),36500),ROW(A81))))","v":""},{"$f":"INDEX(信誉提升汇总记录表!A:A,SMALL(IF(信誉提升汇总记录表!$A:$A=$C$2,ROW($B:$B),36500),ROW(B81)))&\"\"","v":""},{"$f":"INDEX(信誉提升汇总记录表!C:C,SMALL(IF(信誉提升汇总记录表!$A:$A=$C$2,ROW($B:$B),36500),ROW(C81)))&\"\"","v":""},{"$f":"INDEX(信誉提升汇总记录表!D:D,SMALL(IF(信誉提升汇总记录表!$A:$A=$C$2,ROW($B:$B),36500),ROW(D81)))&\"\"","v":""},{"$f":"IF(ISERROR(VALUE(INDEX(信誉提升汇总记录表!E:E,SMALL(IF(信誉提升汇总记录表!$A:$A=$C$2,ROW($B:$B),36500),ROW(E81)))&\"\")),\"\",VALUE(INDEX(信誉提升汇总记录表!E:E,SMALL(IF(信誉提升汇总记录表!$A:$A=$C$2,ROW($B:$B),36500),ROW(E81)))&\"\"))","v":""},{"$f":"INDEX(信誉提升汇总记录表!J:J,SMALL(IF(信誉提升汇总记录表!$A:$A=$C$2,ROW($B:$B),36500),ROW(F81)))&\"\"","v":""},{"$f":"INDEX(信誉提升汇总记录表!K:K,SMALL(IF(信誉提升汇总记录表!$A:$A=$C$2,ROW($B:$B),36500),ROW(G81)))&\"\"","v":""},{"$f":"INDEX(信誉提升汇总记录表!M:M,SMALL(IF(信誉提升汇总记录表!$A:$A=$C$2,ROW($B:$B),36500),ROW(H81)))&\"\"","v":""}]
[{"$f":"IF(B85=\"\",\"\",INDEX(信誉提升汇总记录表!B:B,SMALL(IF(信誉提升汇总记录表!$A:$A=$C$2,ROW($B:$B),36500),ROW(A82))))","v":""},{"$f":"INDEX(信誉提升汇总记录表!A:A,SMALL(IF(信誉提升汇总记录表!$A:$A=$C$2,ROW($B:$B),36500),ROW(B82)))&\"\"","v":""},{"$f":"INDEX(信誉提升汇总记录表!C:C,SMALL(IF(信誉提升汇总记录表!$A:$A=$C$2,ROW($B:$B),36500),ROW(C82)))&\"\"","v":""},{"$f":"INDEX(信誉提升汇总记录表!D:D,SMALL(IF(信誉提升汇总记录表!$A:$A=$C$2,ROW($B:$B),36500),ROW(D82)))&\"\"","v":""},{"$f":"IF(ISERROR(VALUE(INDEX(信誉提升汇总记录表!E:E,SMALL(IF(信誉提升汇总记录表!$A:$A=$C$2,ROW($B:$B),36500),ROW(E82)))&\"\")),\"\",VALUE(INDEX(信誉提升汇总记录表!E:E,SMALL(IF(信誉提升汇总记录表!$A:$A=$C$2,ROW($B:$B),36500),ROW(E82)))&\"\"))","v":""},{"$f":"INDEX(信誉提升汇总记录表!J:J,SMALL(IF(信誉提升汇总记录表!$A:$A=$C$2,ROW($B:$B),36500),ROW(F82)))&\"\"","v":""},{"$f":"INDEX(信誉提升汇总记录表!K:K,SMALL(IF(信誉提升汇总记录表!$A:$A=$C$2,ROW($B:$B),36500),ROW(G82)))&\"\"","v":""},{"$f":"INDEX(信誉提升汇总记录表!M:M,SMALL(IF(信誉提升汇总记录表!$A:$A=$C$2,ROW($B:$B),36500),ROW(H82)))&\"\"","v":""}]
[{"$f":"IF(B86=\"\",\"\",INDEX(信誉提升汇总记录表!B:B,SMALL(IF(信誉提升汇总记录表!$A:$A=$C$2,ROW($B:$B),36500),ROW(A83))))","v":""},{"$f":"INDEX(信誉提升汇总记录表!A:A,SMALL(IF(信誉提升汇总记录表!$A:$A=$C$2,ROW($B:$B),36500),ROW(B83)))&\"\"","v":""},{"$f":"INDEX(信誉提升汇总记录表!C:C,SMALL(IF(信誉提升汇总记录表!$A:$A=$C$2,ROW($B:$B),36500),ROW(C83)))&\"\"","v":""},{"$f":"INDEX(信誉提升汇总记录表!D:D,SMALL(IF(信誉提升汇总记录表!$A:$A=$C$2,ROW($B:$B),36500),ROW(D83)))&\"\"","v":""},{"$f":"IF(ISERROR(VALUE(INDEX(信誉提升汇总记录表!E:E,SMALL(IF(信誉提升汇总记录表!$A:$A=$C$2,ROW($B:$B),36500),ROW(E83)))&\"\")),\"\",VALUE(INDEX(信誉提升汇总记录表!E:E,SMALL(IF(信誉提升汇总记录表!$A:$A=$C$2,ROW($B:$B),36500),ROW(E83)))&\"\"))","v":""},{"$f":"INDEX(信誉提升汇总记录表!J:J,SMALL(IF(信誉提升汇总记录表!$A:$A=$C$2,ROW($B:$B),36500),ROW(F83)))&\"\"","v":""},{"$f":"INDEX(信誉提升汇总记录表!K:K,SMALL(IF(信誉提升汇总记录表!$A:$A=$C$2,ROW($B:$B),36500),ROW(G83)))&\"\"","v":""},{"$f":"INDEX(信誉提升汇总记录表!M:M,SMALL(IF(信誉提升汇总记录表!$A:$A=$C$2,ROW($B:$B),36500),ROW(H83)))&\"\"","v":""}]
[{"$f":"IF(B87=\"\",\"\",INDEX(信誉提升汇总记录表!B:B,SMALL(IF(信誉提升汇总记录表!$A:$A=$C$2,ROW($B:$B),36500),ROW(A84))))","v":""},{"$f":"INDEX(信誉提升汇总记录表!A:A,SMALL(IF(信誉提升汇总记录表!$A:$A=$C$2,ROW($B:$B),36500),ROW(B84)))&\"\"","v":""},{"$f":"INDEX(信誉提升汇总记录表!C:C,SMALL(IF(信誉提升汇总记录表!$A:$A=$C$2,ROW($B:$B),36500),ROW(C84)))&\"\"","v":""},{"$f":"INDEX(信誉提升汇总记录表!D:D,SMALL(IF(信誉提升汇总记录表!$A:$A=$C$2,ROW($B:$B),36500),ROW(D84)))&\"\"","v":""},{"$f":"IF(ISERROR(VALUE(INDEX(信誉提升汇总记录表!E:E,SMALL(IF(信誉提升汇总记录表!$A:$A=$C$2,ROW($B:$B),36500),ROW(E84)))&\"\")),\"\",VALUE(INDEX(信誉提升汇总记录表!E:E,SMALL(IF(信誉提升汇总记录表!$A:$A=$C$2,ROW($B:$B),36500),ROW(E84)))&\"\"))","v":""},{"$f":"INDEX(信誉提升汇总记录表!J:J,SMALL(IF(信誉提升汇总记录表!$A:$A=$C$2,ROW($B:$B),36500),ROW(F84)))&\"\"","v":""},{"$f":"INDEX(信誉提升汇总记录表!K:K,SMALL(IF(信誉提升汇总记录表!$A:$A=$C$2,ROW($B:$B),36500),ROW(G84)))&\"\"","v":""},{"$f":"INDEX(信誉提升汇总记录表!M:M,SMALL(IF(信誉提升汇总记录表!$A:$A=$C$2,ROW($B:$B),36500),ROW(H84)))&\"\"","v":""}]
[{"$f":"IF(B88=\"\",\"\",INDEX(信誉提升汇总记录表!B:B,SMALL(IF(信誉提升汇总记录表!$A:$A=$C$2,ROW($B:$B),36500),ROW(A85))))","v":""},{"$f":"INDEX(信誉提升汇总记录表!A:A,SMALL(IF(信誉提升汇总记录表!$A:$A=$C$2,ROW($B:$B),36500),ROW(B85)))&\"\"","v":""},{"$f":"INDEX(信誉提升汇总记录表!C:C,SMALL(IF(信誉提升汇总记录表!$A:$A=$C$2,ROW($B:$B),36500),ROW(C85)))&\"\"","v":""},{"$f":"INDEX(信誉提升汇总记录表!D:D,SMALL(IF(信誉提升汇总记录表!$A:$A=$C$2,ROW($B:$B),36500),ROW(D85)))&\"\"","v":""},{"$f":"IF(ISERROR(VALUE(INDEX(信誉提升汇总记录表!E:E,SMALL(IF(信誉提升汇总记录表!$A:$A=$C$2,ROW($B:$B),36500),ROW(E85)))&\"\")),\"\",VALUE(INDEX(信誉提升汇总记录表!E:E,SMALL(IF(信誉提升汇总记录表!$A:$A=$C$2,ROW($B:$B),36500),ROW(E85)))&\"\"))","v":""},{"$f":"INDEX(信誉提升汇总记录表!J:J,SMALL(IF(信誉提升汇总记录表!$A:$A=$C$2,ROW($B:$B),36500),ROW(F85)))&\"\"","v":""},{"$f":"INDEX(信誉提升汇总记录表!K:K,SMALL(IF(信誉提升汇总记录表!$A:$A=$C$2,ROW($B:$B),36500),ROW(G85)))&\"\"","v":""},{"$f":"INDEX(信誉提升汇总记录表!M:M,SMALL(IF(信誉提升汇总记录表!$A:$A=$C$2,ROW($B:$B),36500),ROW(H85)))&\"\"","v":""}]
[{"$f":"IF(B89=\"\",\"\",INDEX(信誉提升汇总记录表!B:B,SMALL(IF(信誉提升汇总记录表!$A:$A=$C$2,ROW($B:$B),36500),ROW(A86))))","v":""},{"$f":"INDEX(信誉提升汇总记录表!A:A,SMALL(IF(信誉提升汇总记录表!$A:$A=$C$2,ROW($B:$B),36500),ROW(B86)))&\"\"","v":""},{"$f":"INDEX(信誉提升汇总记录表!C:C,SMALL(IF(信誉提升汇总记录表!$A:$A=$C$2,ROW($B:$B),36500),ROW(C86)))&\"\"","v":""},{"$f":"INDEX(信誉提升汇总记录表!D:D,SMALL(IF(信誉提升汇总记录表!$A:$A=$C$2,ROW($B:$B),36500),ROW(D86)))&\"\"","v":""},{"$f":"IF(ISERROR(VALUE(INDEX(信誉提升汇总记录表!E:E,SMALL(IF(信誉提升汇总记录表!$A:$A=$C$2,ROW($B:$B),36500),ROW(E86)))&\"\")),\"\",VALUE(INDEX(信誉提升汇总记录表!E:E,SMALL(IF(信誉提升汇总记录表!$A:$A=$C$2,ROW($B:$B),36500),ROW(E86)))&\"\"))","v":""},{"$f":"INDEX(信誉提升汇总记录表!J:J,SMALL(IF(信誉提升汇总记录表!$A:$A=$C$2,ROW($B:$B),36500),ROW(F86)))&\"\"","v":""},{"$f":"INDEX(信誉提升汇总记录表!K:K,SMALL(IF(信誉提升汇总记录表!$A:$A=$C$2,ROW($B:$B),36500),ROW(G86)))&\"\"","v":""},{"$f":"INDEX(信誉提升汇总记录表!M:M,SMALL(IF(信誉提升汇总记录表!$A:$A=$C$2,ROW($B:$B),36500),ROW(H86)))&\"\"","v":""}]
[{"$f":"IF(B90=\"\",\"\",INDEX(信誉提升汇总记录表!B:B,SMALL(IF(信誉提升汇总记录表!$A:$A=$C$2,ROW($B:$B),36500),ROW(A87))))","v":""},{"$f":"INDEX(信誉提升汇总记录表!A:A,SMALL(IF(信誉提升汇总记录表!$A:$A=$C$2,ROW($B:$B),36500),ROW(B87)))&\"\"","v":""},{"$f":"INDEX(信誉提升汇总记录表!C:C,SMALL(IF(信誉提升汇总记录表!$A:$A=$C$2,ROW($B:$B),36500),ROW(C87)))&\"\"","v":""},{"$f":"INDEX(信誉提升汇总记录表!D:D,SMALL(IF(信誉提升汇总记录表!$A:$A=$C$2,ROW($B:$B),36500),ROW(D87)))&\"\"","v":""},{"$f":"IF(ISERROR(VALUE(INDEX(信誉提升汇总记录表!E:E,SMALL(IF(信誉提升汇总记录表!$A:$A=$C$2,ROW($B:$B),36500),ROW(E87)))&\"\")),\"\",VALUE(INDEX(信誉提升汇总记录表!E:E,SMALL(IF(信誉提升汇总记录表!$A:$A=$C$2,ROW($B:$B),36500),ROW(E87)))&\"\"))","v":""},{"$f":"INDEX(信誉提升汇总记录表!J:J,SMALL(IF(信誉提升汇总记录表!$A:$A=$C$2,ROW($B:$B),36500),ROW(F87)))&\"\"","v":""},{"$f":"INDEX(信誉提升汇总记录表!K:K,SMALL(IF(信誉提升汇总记录表!$A:$A=$C$2,ROW($B:$B),36500),ROW(G87)))&\"\"","v":""},{"$f":"INDEX(信誉提升汇总记录表!M:M,SMALL(IF(信誉提升汇总记录表!$A:$A=$C$2,ROW($B:$B),36500),ROW(H87)))&\"\"","v":""}]
[{"$f":"IF(B91=\"\",\"\",INDEX(信誉提升汇总记录表!B:B,SMALL(IF(信誉提升汇总记录表!$A:$A=$C$2,ROW($B:$B),36500),ROW(A88))))","v":""},{"$f":"INDEX(信誉提升汇总记录表!A:A,SMALL(IF(信誉提升汇总记录表!$A:$A=$C$2,ROW($B:$B),36500),ROW(B88)))&\"\"","v":""},{"$f":"INDEX(信誉提升汇总记录表!C:C,SMALL(IF(信誉提升汇总记录表!$A:$A=$C$2,ROW($B:$B),36500),ROW(C88)))&\"\"","v":""},{"$f":"INDEX(信誉提升汇总记录表!D:D,SMALL(IF(信誉提升汇总记录表!$A:$A=$C$2,ROW($B:$B),36500),ROW(D88)))&\"\"","v":""},{"$f":"IF(ISERROR(VALUE(INDEX(信誉提升汇总记录表!E:E,SMALL(IF(信誉提升汇总记录表!$A:$A=$C$2,ROW($B:$B),36500),ROW(E88)))&\"\")),\"\",VALUE(INDEX(信誉提升汇总记录表!E:E,SMALL(IF(信誉提升汇总记录表!$A:$A=$C$2,ROW($B:$B),36500),ROW(E88)))&\"\"))","v":""},{"$f":"INDEX(信誉提升汇总记录表!J:J,SMALL(IF(信誉提升汇总记录表!$A:$A=$C$2,ROW($B:$B),36500),ROW(F88)))&\"\"","v":""},{"$f":"INDEX(信誉提升汇总记录表!K:K,SMALL(IF(信誉提升汇总记录表!$A:$A=$C$2,ROW($B:$B),36500),ROW(G88)))&\"\"","v":""},{"$f":"INDEX(信誉提升汇总记录表!M:M,SMALL(IF(信誉提升汇总记录表!$A:$A=$C$2,ROW($B:$B),36500),ROW(H88)))&\"\"","v":""}]
[{"$f":"IF(B92=\"\",\"\",INDEX(信誉提升汇总记录表!B:B,SMALL(IF(信誉提升汇总记录表!$A:$A=$C$2,ROW($B:$B),36500),ROW(A89))))","v":""},{"$f":"INDEX(信誉提升汇总记录表!A:A,SMALL(IF(信誉提升汇总记录表!$A:$A=$C$2,ROW($B:$B),36500),ROW(B89)))&\"\"","v":""},{"$f":"INDEX(信誉提升汇总记录表!C:C,SMALL(IF(信誉提升汇总记录表!$A:$A=$C$2,ROW($B:$B),36500),ROW(C89)))&\"\"","v":""},{"$f":"INDEX(信誉提升汇总记录表!D:D,SMALL(IF(信誉提升汇总记录表!$A:$A=$C$2,ROW($B:$B),36500),ROW(D89)))&\"\"","v":""},{"$f":"IF(ISERROR(VALUE(INDEX(信誉提升汇总记录表!E:E,SMALL(IF(信誉提升汇总记录表!$A:$A=$C$2,ROW($B:$B),36500),ROW(E89)))&\"\")),\"\",VALUE(INDEX(信誉提升汇总记录表!E:E,SMALL(IF(信誉提升汇总记录表!$A:$A=$C$2,ROW($B:$B),36500),ROW(E89)))&\"\"))","v":""},{"$f":"INDEX(信誉提升汇总记录表!J:J,SMALL(IF(信誉提升汇总记录表!$A:$A=$C$2,ROW($B:$B),36500),ROW(F89)))&\"\"","v":""},{"$f":"INDEX(信誉提升汇总记录表!K:K,SMALL(IF(信誉提升汇总记录表!$A:$A=$C$2,ROW($B:$B),36500),ROW(G89)))&\"\"","v":""},{"$f":"INDEX(信誉提升汇总记录表!M:M,SMALL(IF(信誉提升汇总记录表!$A:$A=$C$2,ROW($B:$B),36500),ROW(H89)))&\"\"","v":""}]
[{"$f":"IF(B93=\"\",\"\",INDEX(信誉提升汇总记录表!B:B,SMALL(IF(信誉提升汇总记录表!$A:$A=$C$2,ROW($B:$B),36500),ROW(A90))))","v":""},{"$f":"INDEX(信誉提升汇总记录表!A:A,SMALL(IF(信誉提升汇总记录表!$A:$A=$C$2,ROW($B:$B),36500),ROW(B90)))&\"\"","v":""},{"$f":"INDEX(信誉提升汇总记录表!C:C,SMALL(IF(信誉提升汇总记录表!$A:$A=$C$2,ROW($B:$B),36500),ROW(C90)))&\"\"","v":""},{"$f":"INDEX(信誉提升汇总记录表!D:D,SMALL(IF(信誉提升汇总记录表!$A:$A=$C$2,ROW($B:$B),36500),ROW(D90)))&\"\"","v":""},{"$f":"IF(ISERROR(VALUE(INDEX(信誉提升汇总记录表!E:E,SMALL(IF(信誉提升汇总记录表!$A:$A=$C$2,ROW($B:$B),36500),ROW(E90)))&\"\")),\"\",VALUE(INDEX(信誉提升汇总记录表!E:E,SMALL(IF(信誉提升汇总记录表!$A:$A=$C$2,ROW($B:$B),36500),ROW(E90)))&\"\"))","v":""},{"$f":"INDEX(信誉提升汇总记录表!J:J,SMALL(IF(信誉提升汇总记录表!$A:$A=$C$2,ROW($B:$B),36500),ROW(F90)))&\"\"","v":""},{"$f":"INDEX(信誉提升汇总记录表!K:K,SMALL(IF(信誉提升汇总记录表!$A:$A=$C$2,ROW($B:$B),36500),ROW(G90)))&\"\"","v":""},{"$f":"INDEX(信誉提升汇总记录表!M:M,SMALL(IF(信誉提升汇总记录表!$A:$A=$C$2,ROW($B:$B),36500),ROW(H90)))&\"\"","v":""}]
[{"$f":"IF(B94=\"\",\"\",INDEX(信誉提升汇总记录表!B:B,SMALL(IF(信誉提升汇总记录表!$A:$A=$C$2,ROW($B:$B),36500),ROW(A91))))","v":""},{"$f":"INDEX(信誉提升汇总记录表!A:A,SMALL(IF(信誉提升汇总记录表!$A:$A=$C$2,ROW($B:$B),36500),ROW(B91)))&\"\"","v":""},{"$f":"INDEX(信誉提升汇总记录表!C:C,SMALL(IF(信誉提升汇总记录表!$A:$A=$C$2,ROW($B:$B),36500),ROW(C91)))&\"\"","v":""},{"$f":"INDEX(信誉提升汇总记录表!D:D,SMALL(IF(信誉提升汇总记录表!$A:$A=$C$2,ROW($B:$B),36500),ROW(D91)))&\"\"","v":""},{"$f":"IF(ISERROR(VALUE(INDEX(信誉提升汇总记录表!E:E,SMALL(IF(信誉提升汇总记录表!$A:$A=$C$2,ROW($B:$B),36500),ROW(E91)))&\"\")),\"\",VALUE(INDEX(信誉提升汇总记录表!E:E,SMALL(IF(信誉提升汇总记录表!$A:$A=$C$2,ROW($B:$B),36500),ROW(E91)))&\"\"))","v":""},{"$f":"INDEX(信誉提升汇总记录表!J:J,SMALL(IF(信誉提升汇总记录表!$A:$A=$C$2,ROW($B:$B),36500),ROW(F91)))&\"\"","v":""},{"$f":"INDEX(信誉提升汇总记录表!K:K,SMALL(IF(信誉提升汇总记录表!$A:$A=$C$2,ROW($B:$B),36500),ROW(G91)))&\"\"","v":""},{"$f":"INDEX(信誉提升汇总记录表!M:M,SMALL(IF(信誉提升汇总记录表!$A:$A=$C$2,ROW($B:$B),36500),ROW(H91)))&\"\"","v":""}]
[{"$f":"IF(B95=\"\",\"\",INDEX(信誉提升汇总记录表!B:B,SMALL(IF(信誉提升汇总记录表!$A:$A=$C$2,ROW($B:$B),36500),ROW(A92))))","v":""},{"$f":"INDEX(信誉提升汇总记录表!A:A,SMALL(IF(信誉提升汇总记录表!$A:$A=$C$2,ROW($B:$B),36500),ROW(B92)))&\"\"","v":""},{"$f":"INDEX(信誉提升汇总记录表!C:C,SMALL(IF(信誉提升汇总记录表!$A:$A=$C$2,ROW($B:$B),36500),ROW(C92)))&\"\"","v":""},{"$f":"INDEX(信誉提升汇总记录表!D:D,SMALL(IF(信誉提升汇总记录表!$A:$A=$C$2,ROW($B:$B),36500),ROW(D92)))&\"\"","v":""},{"$f":"IF(ISERROR(VALUE(INDEX(信誉提升汇总记录表!E:E,SMALL(IF(信誉提升汇总记录表!$A:$A=$C$2,ROW($B:$B),36500),ROW(E92)))&\"\")),\"\",VALUE(INDEX(信誉提升汇总记录表!E:E,SMALL(IF(信誉提升汇总记录表!$A:$A=$C$2,ROW($B:$B),36500),ROW(E92)))&\"\"))","v":""},{"$f":"INDEX(信誉提升汇总记录表!J:J,SMALL(IF(信誉提升汇总记录表!$A:$A=$C$2,ROW($B:$B),36500),ROW(F92)))&\"\"","v":""},{"$f":"INDEX(信誉提升汇总记录表!K:K,SMALL(IF(信誉提升汇总记录表!$A:$A=$C$2,ROW($B:$B),36500),ROW(G92)))&\"\"","v":""},{"$f":"INDEX(信誉提升汇总记录表!M:M,SMALL(IF(信誉提升汇总记录表!$A:$A=$C$2,ROW($B:$B),36500),ROW(H92)))&\"\"","v":""}]
[{"$f":"IF(B96=\"\",\"\",INDEX(信誉提升汇总记录表!B:B,SMALL(IF(信誉提升汇总记录表!$A:$A=$C$2,ROW($B:$B),36500),ROW(A93))))","v":""},{"$f":"INDEX(信誉提升汇总记录表!A:A,SMALL(IF(信誉提升汇总记录表!$A:$A=$C$2,ROW($B:$B),36500),ROW(B93)))&\"\"","v":""},{"$f":"INDEX(信誉提升汇总记录表!C:C,SMALL(IF(信誉提升汇总记录表!$A:$A=$C$2,ROW($B:$B),36500),ROW(C93)))&\"\"","v":""},{"$f":"INDEX(信誉提升汇总记录表!D:D,SMALL(IF(信誉提升汇总记录表!$A:$A=$C$2,ROW($B:$B),36500),ROW(D93)))&\"\"","v":""},{"$f":"IF(ISERROR(VALUE(INDEX(信誉提升汇总记录表!E:E,SMALL(IF(信誉提升汇总记录表!$A:$A=$C$2,ROW($B:$B),36500),ROW(E93)))&\"\")),\"\",VALUE(INDEX(信誉提升汇总记录表!E:E,SMALL(IF(信誉提升汇总记录表!$A:$A=$C$2,ROW($B:$B),36500),ROW(E93)))&\"\"))","v":""},{"$f":"INDEX(信誉提升汇总记录表!J:J,SMALL(IF(信誉提升汇总记录表!$A:$A=$C$2,ROW($B:$B),36500),ROW(F93)))&\"\"","v":""},{"$f":"INDEX(信誉提升汇总记录表!K:K,SMALL(IF(信誉提升汇总记录表!$A:$A=$C$2,ROW($B:$B),36500),ROW(G93)))&\"\"","v":""},{"$f":"INDEX(信誉提升汇总记录表!M:M,SMALL(IF(信誉提升汇总记录表!$A:$A=$C$2,ROW($B:$B),36500),ROW(H93)))&\"\"","v":""}]
[{"$f":"IF(B97=\"\",\"\",INDEX(信誉提升汇总记录表!B:B,SMALL(IF(信誉提升汇总记录表!$A:$A=$C$2,ROW($B:$B),36500),ROW(A94))))","v":""},{"$f":"INDEX(信誉提升汇总记录表!A:A,SMALL(IF(信誉提升汇总记录表!$A:$A=$C$2,ROW($B:$B),36500),ROW(B94)))&\"\"","v":""},{"$f":"INDEX(信誉提升汇总记录表!C:C,SMALL(IF(信誉提升汇总记录表!$A:$A=$C$2,ROW($B:$B),36500),ROW(C94)))&\"\"","v":""},{"$f":"INDEX(信誉提升汇总记录表!D:D,SMALL(IF(信誉提升汇总记录表!$A:$A=$C$2,ROW($B:$B),36500),ROW(D94)))&\"\"","v":""},{"$f":"IF(ISERROR(VALUE(INDEX(信誉提升汇总记录表!E:E,SMALL(IF(信誉提升汇总记录表!$A:$A=$C$2,ROW($B:$B),36500),ROW(E94)))&\"\")),\"\",VALUE(INDEX(信誉提升汇总记录表!E:E,SMALL(IF(信誉提升汇总记录表!$A:$A=$C$2,ROW($B:$B),36500),ROW(E94)))&\"\"))","v":""},{"$f":"INDEX(信誉提升汇总记录表!J:J,SMALL(IF(信誉提升汇总记录表!$A:$A=$C$2,ROW($B:$B),36500),ROW(F94)))&\"\"","v":""},{"$f":"INDEX(信誉提升汇总记录表!K:K,SMALL(IF(信誉提升汇总记录表!$A:$A=$C$2,ROW($B:$B),36500),ROW(G94)))&\"\"","v":""},{"$f":"INDEX(信誉提升汇总记录表!M:M,SMALL(IF(信誉提升汇总记录表!$A:$A=$C$2,ROW($B:$B),36500),ROW(H94)))&\"\"","v":""}]
[{"$f":"IF(B98=\"\",\"\",INDEX(信誉提升汇总记录表!B:B,SMALL(IF(信誉提升汇总记录表!$A:$A=$C$2,ROW($B:$B),36500),ROW(A95))))","v":""},{"$f":"INDEX(信誉提升汇总记录表!A:A,SMALL(IF(信誉提升汇总记录表!$A:$A=$C$2,ROW($B:$B),36500),ROW(B95)))&\"\"","v":""},{"$f":"INDEX(信誉提升汇总记录表!C:C,SMALL(IF(信誉提升汇总记录表!$A:$A=$C$2,ROW($B:$B),36500),ROW(C95)))&\"\"","v":""},{"$f":"INDEX(信誉提升汇总记录表!D:D,SMALL(IF(信誉提升汇总记录表!$A:$A=$C$2,ROW($B:$B),36500),ROW(D95)))&\"\"","v":""},{"$f":"IF(ISERROR(VALUE(INDEX(信誉提升汇总记录表!E:E,SMALL(IF(信誉提升汇总记录表!$A:$A=$C$2,ROW($B:$B),36500),ROW(E95)))&\"\")),\"\",VALUE(INDEX(信誉提升汇总记录表!E:E,SMALL(IF(信誉提升汇总记录表!$A:$A=$C$2,ROW($B:$B),36500),ROW(E95)))&\"\"))","v":""},{"$f":"INDEX(信誉提升汇总记录表!J:J,SMALL(IF(信誉提升汇总记录表!$A:$A=$C$2,ROW($B:$B),36500),ROW(F95)))&\"\"","v":""},{"$f":"INDEX(信誉提升汇总记录表!K:K,SMALL(IF(信誉提升汇总记录表!$A:$A=$C$2,ROW($B:$B),36500),ROW(G95)))&\"\"","v":""},{"$f":"INDEX(信誉提升汇总记录表!M:M,SMALL(IF(信誉提升汇总记录表!$A:$A=$C$2,ROW($B:$B),36500),ROW(H95)))&\"\"","v":""}]
[{"$f":"IF(B99=\"\",\"\",INDEX(信誉提升汇总记录表!B:B,SMALL(IF(信誉提升汇总记录表!$A:$A=$C$2,ROW($B:$B),36500),ROW(A96))))","v":""},{"$f":"INDEX(信誉提升汇总记录表!A:A,SMALL(IF(信誉提升汇总记录表!$A:$A=$C$2,ROW($B:$B),36500),ROW(B96)))&\"\"","v":""},{"$f":"INDEX(信誉提升汇总记录表!C:C,SMALL(IF(信誉提升汇总记录表!$A:$A=$C$2,ROW($B:$B),36500),ROW(C96)))&\"\"","v":""},{"$f":"INDEX(信誉提升汇总记录表!D:D,SMALL(IF(信誉提升汇总记录表!$A:$A=$C$2,ROW($B:$B),36500),ROW(D96)))&\"\"","v":""},{"$f":"IF(ISERROR(VALUE(INDEX(信誉提升汇总记录表!E:E,SMALL(IF(信誉提升汇总记录表!$A:$A=$C$2,ROW($B:$B),36500),ROW(E96)))&\"\")),\"\",VALUE(INDEX(信誉提升汇总记录表!E:E,SMALL(IF(信誉提升汇总记录表!$A:$A=$C$2,ROW($B:$B),36500),ROW(E96)))&\"\"))","v":""},{"$f":"INDEX(信誉提升汇总记录表!J:J,SMALL(IF(信誉提升汇总记录表!$A:$A=$C$2,ROW($B:$B),36500),ROW(F96)))&\"\"","v":""},{"$f":"INDEX(信誉提升汇总记录表!K:K,SMALL(IF(信誉提升汇总记录表!$A:$A=$C$2,ROW($B:$B),36500),ROW(G96)))&\"\"","v":""},{"$f":"INDEX(信誉提升汇总记录表!M:M,SMALL(IF(信誉提升汇总记录表!$A:$A=$C$2,ROW($B:$B),36500),ROW(H96)))&\"\"","v":""}]
[{"$f":"IF(B100=\"\",\"\",INDEX(信誉提升汇总记录表!B:B,SMALL(IF(信誉提升汇总记录表!$A:$A=$C$2,ROW($B:$B),36500),ROW(A97))))","v":""},{"$f":"INDEX(信誉提升汇总记录表!A:A,SMALL(IF(信誉提升汇总记录表!$A:$A=$C$2,ROW($B:$B),36500),ROW(B97)))&\"\"","v":""},{"$f":"INDEX(信誉提升汇总记录表!C:C,SMALL(IF(信誉提升汇总记录表!$A:$A=$C$2,ROW($B:$B),36500),ROW(C97)))&\"\"","v":""},{"$f":"INDEX(信誉提升汇总记录表!D:D,SMALL(IF(信誉提升汇总记录表!$A:$A=$C$2,ROW($B:$B),36500),ROW(D97)))&\"\"","v":""},{"$f":"IF(ISERROR(VALUE(INDEX(信誉提升汇总记录表!E:E,SMALL(IF(信誉提升汇总记录表!$A:$A=$C$2,ROW($B:$B),36500),ROW(E97)))&\"\")),\"\",VALUE(INDEX(信誉提升汇总记录表!E:E,SMALL(IF(信誉提升汇总记录表!$A:$A=$C$2,ROW($B:$B),36500),ROW(E97)))&\"\"))","v":""},{"$f":"INDEX(信誉提升汇总记录表!J:J,SMALL(IF(信誉提升汇总记录表!$A:$A=$C$2,ROW($B:$B),36500),ROW(F97)))&\"\"","v":""},{"$f":"INDEX(信誉提升汇总记录表!K:K,SMALL(IF(信誉提升汇总记录表!$A:$A=$C$2,ROW($B:$B),36500),ROW(G97)))&\"\"","v":""},{"$f":"INDEX(信誉提升汇总记录表!M:M,SMALL(IF(信誉提升汇总记录表!$A:$A=$C$2,ROW($B:$B),36500),ROW(H97)))&\"\"","v":""}]
[{"$f":"IF(B101=\"\",\"\",INDEX(信誉提升汇总记录表!B:B,SMALL(IF(信誉提升汇总记录表!$A:$A=$C$2,ROW($B:$B),36500),ROW(A98))))","v":""},{"$f":"INDEX(信誉提升汇总记录表!A:A,SMALL(IF(信誉提升汇总记录表!$A:$A=$C$2,ROW($B:$B),36500),ROW(B98)))&\"\"","v":""},{"$f":"INDEX(信誉提升汇总记录表!C:C,SMALL(IF(信誉提升汇总记录表!$A:$A=$C$2,ROW($B:$B),36500),ROW(C98)))&\"\"","v":""},{"$f":"INDEX(信誉提升汇总记录表!D:D,SMALL(IF(信誉提升汇总记录表!$A:$A=$C$2,ROW($B:$B),36500),ROW(D98)))&\"\"","v":""},{"$f":"IF(ISERROR(VALUE(INDEX(信誉提升汇总记录表!E:E,SMALL(IF(信誉提升汇总记录表!$A:$A=$C$2,ROW($B:$B),36500),ROW(E98)))&\"\")),\"\",VALUE(INDEX(信誉提升汇总记录表!E:E,SMALL(IF(信誉提升汇总记录表!$A:$A=$C$2,ROW($B:$B),36500),ROW(E98)))&\"\"))","v":""},{"$f":"INDEX(信誉提升汇总记录表!J:J,SMALL(IF(信誉提升汇总记录表!$A:$A=$C$2,ROW($B:$B),36500),ROW(F98)))&\"\"","v":""},{"$f":"INDEX(信誉提升汇总记录表!K:K,SMALL(IF(信誉提升汇总记录表!$A:$A=$C$2,ROW($B:$B),36500),ROW(G98)))&\"\"","v":""},{"$f":"INDEX(信誉提升汇总记录表!M:M,SMALL(IF(信誉提升汇总记录表!$A:$A=$C$2,ROW($B:$B),36500),ROW(H98)))&\"\"","v":""}]
[{"$f":"IF(B102=\"\",\"\",INDEX(信誉提升汇总记录表!B:B,SMALL(IF(信誉提升汇总记录表!$A:$A=$C$2,ROW($B:$B),36500),ROW(A99))))","v":""},{"$f":"INDEX(信誉提升汇总记录表!A:A,SMALL(IF(信誉提升汇总记录表!$A:$A=$C$2,ROW($B:$B),36500),ROW(B99)))&\"\"","v":""},{"$f":"INDEX(信誉提升汇总记录表!C:C,SMALL(IF(信誉提升汇总记录表!$A:$A=$C$2,ROW($B:$B),36500),ROW(C99)))&\"\"","v":""},{"$f":"INDEX(信誉提升汇总记录表!D:D,SMALL(IF(信誉提升汇总记录表!$A:$A=$C$2,ROW($B:$B),36500),ROW(D99)))&\"\"","v":""},{"$f":"IF(ISERROR(VALUE(INDEX(信誉提升汇总记录表!E:E,SMALL(IF(信誉提升汇总记录表!$A:$A=$C$2,ROW($B:$B),36500),ROW(E99)))&\"\")),\"\",VALUE(INDEX(信誉提升汇总记录表!E:E,SMALL(IF(信誉提升汇总记录表!$A:$A=$C$2,ROW($B:$B),36500),ROW(E99)))&\"\"))","v":""},{"$f":"INDEX(信誉提升汇总记录表!J:J,SMALL(IF(信誉提升汇总记录表!$A:$A=$C$2,ROW($B:$B),36500),ROW(F99)))&\"\"","v":""},{"$f":"INDEX(信誉提升汇总记录表!K:K,SMALL(IF(信誉提升汇总记录表!$A:$A=$C$2,ROW($B:$B),36500),ROW(G99)))&\"\"","v":""},{"$f":"INDEX(信誉提升汇总记录表!M:M,SMALL(IF(信誉提升汇总记录表!$A:$A=$C$2,ROW($B:$B),36500),ROW(H99)))&\"\"","v":""}]
[{"$f":"IF(B103=\"\",\"\",INDEX(信誉提升汇总记录表!B:B,SMALL(IF(信誉提升汇总记录表!$A:$A=$C$2,ROW($B:$B),36500),ROW(A100))))","v":""},{"$f":"INDEX(信誉提升汇总记录表!A:A,SMALL(IF(信誉提升汇总记录表!$A:$A=$C$2,ROW($B:$B),36500),ROW(B100)))&\"\"","v":""},{"$f":"INDEX(信誉提升汇总记录表!C:C,SMALL(IF(信誉提升汇总记录表!$A:$A=$C$2,ROW($B:$B),36500),ROW(C100)))&\"\"","v":""},{"$f":"INDEX(信誉提升汇总记录表!D:D,SMALL(IF(信誉提升汇总记录表!$A:$A=$C$2,ROW($B:$B),36500),ROW(D100)))&\"\"","v":""},{"$f":"IF(ISERROR(VALUE(INDEX(信誉提升汇总记录表!E:E,SMALL(IF(信誉提升汇总记录表!$A:$A=$C$2,ROW($B:$B),36500),ROW(E100)))&\"\")),\"\",VALUE(INDEX(信誉提升汇总记录表!E:E,SMALL(IF(信誉提升汇总记录表!$A:$A=$C$2,ROW($B:$B),36500),ROW(E100)))&\"\"))","v":""},{"$f":"INDEX(信誉提升汇总记录表!J:J,SMALL(IF(信誉提升汇总记录表!$A:$A=$C$2,ROW($B:$B),36500),ROW(F100)))&\"\"","v":""},{"$f":"INDEX(信誉提升汇总记录表!K:K,SMALL(IF(信誉提升汇总记录表!$A:$A=$C$2,ROW($B:$B),36500),ROW(G100)))&\"\"","v":""},{"$f":"INDEX(信誉提升汇总记录表!M:M,SMALL(IF(信誉提升汇总记录表!$A:$A=$C$2,ROW($B:$B),36500),ROW(H100)))&\"\"","v":""}]
[{"$f":"IF(B104=\"\",\"\",INDEX(信誉提升汇总记录表!B:B,SMALL(IF(信誉提升汇总记录表!$A:$A=$C$2,ROW($B:$B),36500),ROW(A101))))","v":""},{"$f":"INDEX(信誉提升汇总记录表!A:A,SMALL(IF(信誉提升汇总记录表!$A:$A=$C$2,ROW($B:$B),36500),ROW(B101)))&\"\"","v":""},{"$f":"INDEX(信誉提升汇总记录表!C:C,SMALL(IF(信誉提升汇总记录表!$A:$A=$C$2,ROW($B:$B),36500),ROW(C101)))&\"\"","v":""},{"$f":"INDEX(信誉提升汇总记录表!D:D,SMALL(IF(信誉提升汇总记录表!$A:$A=$C$2,ROW($B:$B),36500),ROW(D101)))&\"\"","v":""},{"$f":"IF(ISERROR(VALUE(INDEX(信誉提升汇总记录表!E:E,SMALL(IF(信誉提升汇总记录表!$A:$A=$C$2,ROW($B:$B),36500),ROW(E101)))&\"\")),\"\",VALUE(INDEX(信誉提升汇总记录表!E:E,SMALL(IF(信誉提升汇总记录表!$A:$A=$C$2,ROW($B:$B),36500),ROW(E101)))&\"\"))","v":""},{"$f":"INDEX(信誉提升汇总记录表!J:J,SMALL(IF(信誉提升汇总记录表!$A:$A=$C$2,ROW($B:$B),36500),ROW(F101)))&\"\"","v":""},{"$f":"INDEX(信誉提升汇总记录表!K:K,SMALL(IF(信誉提升汇总记录表!$A:$A=$C$2,ROW($B:$B),36500),ROW(G101)))&\"\"","v":""},{"$f":"INDEX(信誉提升汇总记录表!M:M,SMALL(IF(信誉提升汇总记录表!$A:$A=$C$2,ROW($B:$B),36500),ROW(H101)))&\"\"","v":""}]
[{"$f":"IF(B105=\"\",\"\",INDEX(信誉提升汇总记录表!B:B,SMALL(IF(信誉提升汇总记录表!$A:$A=$C$2,ROW($B:$B),36500),ROW(A102))))","v":""},{"$f":"INDEX(信誉提升汇总记录表!A:A,SMALL(IF(信誉提升汇总记录表!$A:$A=$C$2,ROW($B:$B),36500),ROW(B102)))&\"\"","v":""},{"$f":"INDEX(信誉提升汇总记录表!C:C,SMALL(IF(信誉提升汇总记录表!$A:$A=$C$2,ROW($B:$B),36500),ROW(C102)))&\"\"","v":""},{"$f":"INDEX(信誉提升汇总记录表!D:D,SMALL(IF(信誉提升汇总记录表!$A:$A=$C$2,ROW($B:$B),36500),ROW(D102)))&\"\"","v":""},{"$f":"IF(ISERROR(VALUE(INDEX(信誉提升汇总记录表!E:E,SMALL(IF(信誉提升汇总记录表!$A:$A=$C$2,ROW($B:$B),36500),ROW(E102)))&\"\")),\"\",VALUE(INDEX(信誉提升汇总记录表!E:E,SMALL(IF(信誉提升汇总记录表!$A:$A=$C$2,ROW($B:$B),36500),ROW(E102)))&\"\"))","v":""},{"$f":"INDEX(信誉提升汇总记录表!J:J,SMALL(IF(信誉提升汇总记录表!$A:$A=$C$2,ROW($B:$B),36500),ROW(F102)))&\"\"","v":""},{"$f":"INDEX(信誉提升汇总记录表!K:K,SMALL(IF(信誉提升汇总记录表!$A:$A=$C$2,ROW($B:$B),36500),ROW(G102)))&\"\"","v":""},{"$f":"INDEX(信誉提升汇总记录表!M:M,SMALL(IF(信誉提升汇总记录表!$A:$A=$C$2,ROW($B:$B),36500),ROW(H102)))&\"\"","v":""}]
[{"$f":"IF(B106=\"\",\"\",INDEX(信誉提升汇总记录表!B:B,SMALL(IF(信誉提升汇总记录表!$A:$A=$C$2,ROW($B:$B),36500),ROW(A103))))","v":""},{"$f":"INDEX(信誉提升汇总记录表!A:A,SMALL(IF(信誉提升汇总记录表!$A:$A=$C$2,ROW($B:$B),36500),ROW(B103)))&\"\"","v":""},{"$f":"INDEX(信誉提升汇总记录表!C:C,SMALL(IF(信誉提升汇总记录表!$A:$A=$C$2,ROW($B:$B),36500),ROW(C103)))&\"\"","v":""},{"$f":"INDEX(信誉提升汇总记录表!D:D,SMALL(IF(信誉提升汇总记录表!$A:$A=$C$2,ROW($B:$B),36500),ROW(D103)))&\"\"","v":""},{"$f":"IF(ISERROR(VALUE(INDEX(信誉提升汇总记录表!E:E,SMALL(IF(信誉提升汇总记录表!$A:$A=$C$2,ROW($B:$B),36500),ROW(E103)))&\"\")),\"\",VALUE(INDEX(信誉提升汇总记录表!E:E,SMALL(IF(信誉提升汇总记录表!$A:$A=$C$2,ROW($B:$B),36500),ROW(E103)))&\"\"))","v":""},{"$f":"INDEX(信誉提升汇总记录表!J:J,SMALL(IF(信誉提升汇总记录表!$A:$A=$C$2,ROW($B:$B),36500),ROW(F103)))&\"\"","v":""},{"$f":"INDEX(信誉提升汇总记录表!K:K,SMALL(IF(信誉提升汇总记录表!$A:$A=$C$2,ROW($B:$B),36500),ROW(G103)))&\"\"","v":""},{"$f":"INDEX(信誉提升汇总记录表!M:M,SMALL(IF(信誉提升汇总记录表!$A:$A=$C$2,ROW($B:$B),36500),ROW(H103)))&\"\"","v":""}]
[{"$f":"IF(B107=\"\",\"\",INDEX(信誉提升汇总记录表!B:B,SMALL(IF(信誉提升汇总记录表!$A:$A=$C$2,ROW($B:$B),36500),ROW(A104))))","v":""},{"$f":"INDEX(信誉提升汇总记录表!A:A,SMALL(IF(信誉提升汇总记录表!$A:$A=$C$2,ROW($B:$B),36500),ROW(B104)))&\"\"","v":""},{"$f":"INDEX(信誉提升汇总记录表!C:C,SMALL(IF(信誉提升汇总记录表!$A:$A=$C$2,ROW($B:$B),36500),ROW(C104)))&\"\"","v":""},{"$f":"INDEX(信誉提升汇总记录表!D:D,SMALL(IF(信誉提升汇总记录表!$A:$A=$C$2,ROW($B:$B),36500),ROW(D104)))&\"\"","v":""},{"$f":"IF(ISERROR(VALUE(INDEX(信誉提升汇总记录表!E:E,SMALL(IF(信誉提升汇总记录表!$A:$A=$C$2,ROW($B:$B),36500),ROW(E104)))&\"\")),\"\",VALUE(INDEX(信誉提升汇总记录表!E:E,SMALL(IF(信誉提升汇总记录表!$A:$A=$C$2,ROW($B:$B),36500),ROW(E104)))&\"\"))","v":""},{"$f":"INDEX(信誉提升汇总记录表!J:J,SMALL(IF(信誉提升汇总记录表!$A:$A=$C$2,ROW($B:$B),36500),ROW(F104)))&\"\"","v":""},{"$f":"INDEX(信誉提升汇总记录表!K:K,SMALL(IF(信誉提升汇总记录表!$A:$A=$C$2,ROW($B:$B),36500),ROW(G104)))&\"\"","v":""},{"$f":"INDEX(信誉提升汇总记录表!M:M,SMALL(IF(信誉提升汇总记录表!$A:$A=$C$2,ROW($B:$B),36500),ROW(H104)))&\"\"","v":""}]
[{"$f":"IF(B108=\"\",\"\",INDEX(信誉提升汇总记录表!B:B,SMALL(IF(信誉提升汇总记录表!$A:$A=$C$2,ROW($B:$B),36500),ROW(A105))))","v":""},{"$f":"INDEX(信誉提升汇总记录表!A:A,SMALL(IF(信誉提升汇总记录表!$A:$A=$C$2,ROW($B:$B),36500),ROW(B105)))&\"\"","v":""},{"$f":"INDEX(信誉提升汇总记录表!C:C,SMALL(IF(信誉提升汇总记录表!$A:$A=$C$2,ROW($B:$B),36500),ROW(C105)))&\"\"","v":""},{"$f":"INDEX(信誉提升汇总记录表!D:D,SMALL(IF(信誉提升汇总记录表!$A:$A=$C$2,ROW($B:$B),36500),ROW(D105)))&\"\"","v":""},{"$f":"IF(ISERROR(VALUE(INDEX(信誉提升汇总记录表!E:E,SMALL(IF(信誉提升汇总记录表!$A:$A=$C$2,ROW($B:$B),36500),ROW(E105)))&\"\")),\"\",VALUE(INDEX(信誉提升汇总记录表!E:E,SMALL(IF(信誉提升汇总记录表!$A:$A=$C$2,ROW($B:$B),36500),ROW(E105)))&\"\"))","v":""},{"$f":"INDEX(信誉提升汇总记录表!J:J,SMALL(IF(信誉提升汇总记录表!$A:$A=$C$2,ROW($B:$B),36500),ROW(F105)))&\"\"","v":""},{"$f":"INDEX(信誉提升汇总记录表!K:K,SMALL(IF(信誉提升汇总记录表!$A:$A=$C$2,ROW($B:$B),36500),ROW(G105)))&\"\"","v":""},{"$f":"INDEX(信誉提升汇总记录表!M:M,SMALL(IF(信誉提升汇总记录表!$A:$A=$C$2,ROW($B:$B),36500),ROW(H105)))&\"\"","v":""}]
[{"$f":"IF(B109=\"\",\"\",INDEX(信誉提升汇总记录表!B:B,SMALL(IF(信誉提升汇总记录表!$A:$A=$C$2,ROW($B:$B),36500),ROW(A106))))","v":""},{"$f":"INDEX(信誉提升汇总记录表!A:A,SMALL(IF(信誉提升汇总记录表!$A:$A=$C$2,ROW($B:$B),36500),ROW(B106)))&\"\"","v":""},{"$f":"INDEX(信誉提升汇总记录表!C:C,SMALL(IF(信誉提升汇总记录表!$A:$A=$C$2,ROW($B:$B),36500),ROW(C106)))&\"\"","v":""},{"$f":"INDEX(信誉提升汇总记录表!D:D,SMALL(IF(信誉提升汇总记录表!$A:$A=$C$2,ROW($B:$B),36500),ROW(D106)))&\"\"","v":""},{"$f":"IF(ISERROR(VALUE(INDEX(信誉提升汇总记录表!E:E,SMALL(IF(信誉提升汇总记录表!$A:$A=$C$2,ROW($B:$B),36500),ROW(E106)))&\"\")),\"\",VALUE(INDEX(信誉提升汇总记录表!E:E,SMALL(IF(信誉提升汇总记录表!$A:$A=$C$2,ROW($B:$B),36500),ROW(E106)))&\"\"))","v":""},{"$f":"INDEX(信誉提升汇总记录表!J:J,SMALL(IF(信誉提升汇总记录表!$A:$A=$C$2,ROW($B:$B),36500),ROW(F106)))&\"\"","v":""},{"$f":"INDEX(信誉提升汇总记录表!K:K,SMALL(IF(信誉提升汇总记录表!$A:$A=$C$2,ROW($B:$B),36500),ROW(G106)))&\"\"","v":""},{"$f":"INDEX(信誉提升汇总记录表!M:M,SMALL(IF(信誉提升汇总记录表!$A:$A=$C$2,ROW($B:$B),36500),ROW(H106)))&\"\"","v":""}]
[{"$f":"IF(B110=\"\",\"\",INDEX(信誉提升汇总记录表!B:B,SMALL(IF(信誉提升汇总记录表!$A:$A=$C$2,ROW($B:$B),36500),ROW(A107))))","v":""},{"$f":"INDEX(信誉提升汇总记录表!A:A,SMALL(IF(信誉提升汇总记录表!$A:$A=$C$2,ROW($B:$B),36500),ROW(B107)))&\"\"","v":""},{"$f":"INDEX(信誉提升汇总记录表!C:C,SMALL(IF(信誉提升汇总记录表!$A:$A=$C$2,ROW($B:$B),36500),ROW(C107)))&\"\"","v":""},{"$f":"INDEX(信誉提升汇总记录表!D:D,SMALL(IF(信誉提升汇总记录表!$A:$A=$C$2,ROW($B:$B),36500),ROW(D107)))&\"\"","v":""},{"$f":"IF(ISERROR(VALUE(INDEX(信誉提升汇总记录表!E:E,SMALL(IF(信誉提升汇总记录表!$A:$A=$C$2,ROW($B:$B),36500),ROW(E107)))&\"\")),\"\",VALUE(INDEX(信誉提升汇总记录表!E:E,SMALL(IF(信誉提升汇总记录表!$A:$A=$C$2,ROW($B:$B),36500),ROW(E107)))&\"\"))","v":""},{"$f":"INDEX(信誉提升汇总记录表!J:J,SMALL(IF(信誉提升汇总记录表!$A:$A=$C$2,ROW($B:$B),36500),ROW(F107)))&\"\"","v":""},{"$f":"INDEX(信誉提升汇总记录表!K:K,SMALL(IF(信誉提升汇总记录表!$A:$A=$C$2,ROW($B:$B),36500),ROW(G107)))&\"\"","v":""},{"$f":"INDEX(信誉提升汇总记录表!M:M,SMALL(IF(信誉提升汇总记录表!$A:$A=$C$2,ROW($B:$B),36500),ROW(H107)))&\"\"","v":""}]
[{"$f":"IF(B111=\"\",\"\",INDEX(信誉提升汇总记录表!B:B,SMALL(IF(信誉提升汇总记录表!$A:$A=$C$2,ROW($B:$B),36500),ROW(A108))))","v":""},{"$f":"INDEX(信誉提升汇总记录表!A:A,SMALL(IF(信誉提升汇总记录表!$A:$A=$C$2,ROW($B:$B),36500),ROW(B108)))&\"\"","v":""},{"$f":"INDEX(信誉提升汇总记录表!C:C,SMALL(IF(信誉提升汇总记录表!$A:$A=$C$2,ROW($B:$B),36500),ROW(C108)))&\"\"","v":""},{"$f":"INDEX(信誉提升汇总记录表!D:D,SMALL(IF(信誉提升汇总记录表!$A:$A=$C$2,ROW($B:$B),36500),ROW(D108)))&\"\"","v":""},{"$f":"IF(ISERROR(VALUE(INDEX(信誉提升汇总记录表!E:E,SMALL(IF(信誉提升汇总记录表!$A:$A=$C$2,ROW($B:$B),36500),ROW(E108)))&\"\")),\"\",VALUE(INDEX(信誉提升汇总记录表!E:E,SMALL(IF(信誉提升汇总记录表!$A:$A=$C$2,ROW($B:$B),36500),ROW(E108)))&\"\"))","v":""},{"$f":"INDEX(信誉提升汇总记录表!J:J,SMALL(IF(信誉提升汇总记录表!$A:$A=$C$2,ROW($B:$B),36500),ROW(F108)))&\"\"","v":""},{"$f":"INDEX(信誉提升汇总记录表!K:K,SMALL(IF(信誉提升汇总记录表!$A:$A=$C$2,ROW($B:$B),36500),ROW(G108)))&\"\"","v":""},{"$f":"INDEX(信誉提升汇总记录表!M:M,SMALL(IF(信誉提升汇总记录表!$A:$A=$C$2,ROW($B:$B),36500),ROW(H108)))&\"\"","v":""}]
[{"$f":"IF(B112=\"\",\"\",INDEX(信誉提升汇总记录表!B:B,SMALL(IF(信誉提升汇总记录表!$A:$A=$C$2,ROW($B:$B),36500),ROW(A109))))","v":""},{"$f":"INDEX(信誉提升汇总记录表!A:A,SMALL(IF(信誉提升汇总记录表!$A:$A=$C$2,ROW($B:$B),36500),ROW(B109)))&\"\"","v":""},{"$f":"INDEX(信誉提升汇总记录表!C:C,SMALL(IF(信誉提升汇总记录表!$A:$A=$C$2,ROW($B:$B),36500),ROW(C109)))&\"\"","v":""},{"$f":"INDEX(信誉提升汇总记录表!D:D,SMALL(IF(信誉提升汇总记录表!$A:$A=$C$2,ROW($B:$B),36500),ROW(D109)))&\"\"","v":""},{"$f":"IF(ISERROR(VALUE(INDEX(信誉提升汇总记录表!E:E,SMALL(IF(信誉提升汇总记录表!$A:$A=$C$2,ROW($B:$B),36500),ROW(E109)))&\"\")),\"\",VALUE(INDEX(信誉提升汇总记录表!E:E,SMALL(IF(信誉提升汇总记录表!$A:$A=$C$2,ROW($B:$B),36500),ROW(E109)))&\"\"))","v":""},{"$f":"INDEX(信誉提升汇总记录表!J:J,SMALL(IF(信誉提升汇总记录表!$A:$A=$C$2,ROW($B:$B),36500),ROW(F109)))&\"\"","v":""},{"$f":"INDEX(信誉提升汇总记录表!K:K,SMALL(IF(信誉提升汇总记录表!$A:$A=$C$2,ROW($B:$B),36500),ROW(G109)))&\"\"","v":""},{"$f":"INDEX(信誉提升汇总记录表!M:M,SMALL(IF(信誉提升汇总记录表!$A:$A=$C$2,ROW($B:$B),36500),ROW(H109)))&\"\"","v":""}]
[{"$f":"IF(B113=\"\",\"\",INDEX(信誉提升汇总记录表!B:B,SMALL(IF(信誉提升汇总记录表!$A:$A=$C$2,ROW($B:$B),36500),ROW(A110))))","v":""},{"$f":"INDEX(信誉提升汇总记录表!A:A,SMALL(IF(信誉提升汇总记录表!$A:$A=$C$2,ROW($B:$B),36500),ROW(B110)))&\"\"","v":""},{"$f":"INDEX(信誉提升汇总记录表!C:C,SMALL(IF(信誉提升汇总记录表!$A:$A=$C$2,ROW($B:$B),36500),ROW(C110)))&\"\"","v":""},{"$f":"INDEX(信誉提升汇总记录表!D:D,SMALL(IF(信誉提升汇总记录表!$A:$A=$C$2,ROW($B:$B),36500),ROW(D110)))&\"\"","v":""},{"$f":"IF(ISERROR(VALUE(INDEX(信誉提升汇总记录表!E:E,SMALL(IF(信誉提升汇总记录表!$A:$A=$C$2,ROW($B:$B),36500),ROW(E110)))&\"\")),\"\",VALUE(INDEX(信誉提升汇总记录表!E:E,SMALL(IF(信誉提升汇总记录表!$A:$A=$C$2,ROW($B:$B),36500),ROW(E110)))&\"\"))","v":""},{"$f":"INDEX(信誉提升汇总记录表!J:J,SMALL(IF(信誉提升汇总记录表!$A:$A=$C$2,ROW($B:$B),36500),ROW(F110)))&\"\"","v":""},{"$f":"INDEX(信誉提升汇总记录表!K:K,SMALL(IF(信誉提升汇总记录表!$A:$A=$C$2,ROW($B:$B),36500),ROW(G110)))&\"\"","v":""},{"$f":"INDEX(信誉提升汇总记录表!M:M,SMALL(IF(信誉提升汇总记录表!$A:$A=$C$2,ROW($B:$B),36500),ROW(H110)))&\"\"","v":""}]
[{"$f":"IF(B114=\"\",\"\",INDEX(信誉提升汇总记录表!B:B,SMALL(IF(信誉提升汇总记录表!$A:$A=$C$2,ROW($B:$B),36500),ROW(A111))))","v":""},{"$f":"INDEX(信誉提升汇总记录表!A:A,SMALL(IF(信誉提升汇总记录表!$A:$A=$C$2,ROW($B:$B),36500),ROW(B111)))&\"\"","v":""},{"$f":"INDEX(信誉提升汇总记录表!C:C,SMALL(IF(信誉提升汇总记录表!$A:$A=$C$2,ROW($B:$B),36500),ROW(C111)))&\"\"","v":""},{"$f":"INDEX(信誉提升汇总记录表!D:D,SMALL(IF(信誉提升汇总记录表!$A:$A=$C$2,ROW($B:$B),36500),ROW(D111)))&\"\"","v":""},{"$f":"IF(ISERROR(VALUE(INDEX(信誉提升汇总记录表!E:E,SMALL(IF(信誉提升汇总记录表!$A:$A=$C$2,ROW($B:$B),36500),ROW(E111)))&\"\")),\"\",VALUE(INDEX(信誉提升汇总记录表!E:E,SMALL(IF(信誉提升汇总记录表!$A:$A=$C$2,ROW($B:$B),36500),ROW(E111)))&\"\"))","v":""},{"$f":"INDEX(信誉提升汇总记录表!J:J,SMALL(IF(信誉提升汇总记录表!$A:$A=$C$2,ROW($B:$B),36500),ROW(F111)))&\"\"","v":""},{"$f":"INDEX(信誉提升汇总记录表!K:K,SMALL(IF(信誉提升汇总记录表!$A:$A=$C$2,ROW($B:$B),36500),ROW(G111)))&\"\"","v":""},{"$f":"INDEX(信誉提升汇总记录表!M:M,SMALL(IF(信誉提升汇总记录表!$A:$A=$C$2,ROW($B:$B),36500),ROW(H111)))&\"\"","v":""}]
[{"$f":"IF(B115=\"\",\"\",INDEX(信誉提升汇总记录表!B:B,SMALL(IF(信誉提升汇总记录表!$A:$A=$C$2,ROW($B:$B),36500),ROW(A112))))","v":""},{"$f":"INDEX(信誉提升汇总记录表!A:A,SMALL(IF(信誉提升汇总记录表!$A:$A=$C$2,ROW($B:$B),36500),ROW(B112)))&\"\"","v":""},{"$f":"INDEX(信誉提升汇总记录表!C:C,SMALL(IF(信誉提升汇总记录表!$A:$A=$C$2,ROW($B:$B),36500),ROW(C112)))&\"\"","v":""},{"$f":"INDEX(信誉提升汇总记录表!D:D,SMALL(IF(信誉提升汇总记录表!$A:$A=$C$2,ROW($B:$B),36500),ROW(D112)))&\"\"","v":""},{"$f":"IF(ISERROR(VALUE(INDEX(信誉提升汇总记录表!E:E,SMALL(IF(信誉提升汇总记录表!$A:$A=$C$2,ROW($B:$B),36500),ROW(E112)))&\"\")),\"\",VALUE(INDEX(信誉提升汇总记录表!E:E,SMALL(IF(信誉提升汇总记录表!$A:$A=$C$2,ROW($B:$B),36500),ROW(E112)))&\"\"))","v":""},{"$f":"INDEX(信誉提升汇总记录表!J:J,SMALL(IF(信誉提升汇总记录表!$A:$A=$C$2,ROW($B:$B),36500),ROW(F112)))&\"\"","v":""},{"$f":"INDEX(信誉提升汇总记录表!K:K,SMALL(IF(信誉提升汇总记录表!$A:$A=$C$2,ROW($B:$B),36500),ROW(G112)))&\"\"","v":""},{"$f":"INDEX(信誉提升汇总记录表!M:M,SMALL(IF(信誉提升汇总记录表!$A:$A=$C$2,ROW($B:$B),36500),ROW(H112)))&\"\"","v":""}]
[{"$f":"IF(B116=\"\",\"\",INDEX(信誉提升汇总记录表!B:B,SMALL(IF(信誉提升汇总记录表!$A:$A=$C$2,ROW($B:$B),36500),ROW(A113))))","v":""},{"$f":"INDEX(信誉提升汇总记录表!A:A,SMALL(IF(信誉提升汇总记录表!$A:$A=$C$2,ROW($B:$B),36500),ROW(B113)))&\"\"","v":""},{"$f":"INDEX(信誉提升汇总记录表!C:C,SMALL(IF(信誉提升汇总记录表!$A:$A=$C$2,ROW($B:$B),36500),ROW(C113)))&\"\"","v":""},{"$f":"INDEX(信誉提升汇总记录表!D:D,SMALL(IF(信誉提升汇总记录表!$A:$A=$C$2,ROW($B:$B),36500),ROW(D113)))&\"\"","v":""},{"$f":"IF(ISERROR(VALUE(INDEX(信誉提升汇总记录表!E:E,SMALL(IF(信誉提升汇总记录表!$A:$A=$C$2,ROW($B:$B),36500),ROW(E113)))&\"\")),\"\",VALUE(INDEX(信誉提升汇总记录表!E:E,SMALL(IF(信誉提升汇总记录表!$A:$A=$C$2,ROW($B:$B),36500),ROW(E113)))&\"\"))","v":""},{"$f":"INDEX(信誉提升汇总记录表!J:J,SMALL(IF(信誉提升汇总记录表!$A:$A=$C$2,ROW($B:$B),36500),ROW(F113)))&\"\"","v":""},{"$f":"INDEX(信誉提升汇总记录表!K:K,SMALL(IF(信誉提升汇总记录表!$A:$A=$C$2,ROW($B:$B),36500),ROW(G113)))&\"\"","v":""},{"$f":"INDEX(信誉提升汇总记录表!M:M,SMALL(IF(信誉提升汇总记录表!$A:$A=$C$2,ROW($B:$B),36500),ROW(H113)))&\"\"","v":""}]
[{"$f":"IF(B117=\"\",\"\",INDEX(信誉提升汇总记录表!B:B,SMALL(IF(信誉提升汇总记录表!$A:$A=$C$2,ROW($B:$B),36500),ROW(A114))))","v":""},{"$f":"INDEX(信誉提升汇总记录表!A:A,SMALL(IF(信誉提升汇总记录表!$A:$A=$C$2,ROW($B:$B),36500),ROW(B114)))&\"\"","v":""},{"$f":"INDEX(信誉提升汇总记录表!C:C,SMALL(IF(信誉提升汇总记录表!$A:$A=$C$2,ROW($B:$B),36500),ROW(C114)))&\"\"","v":""},{"$f":"INDEX(信誉提升汇总记录表!D:D,SMALL(IF(信誉提升汇总记录表!$A:$A=$C$2,ROW($B:$B),36500),ROW(D114)))&\"\"","v":""},{"$f":"IF(ISERROR(VALUE(INDEX(信誉提升汇总记录表!E:E,SMALL(IF(信誉提升汇总记录表!$A:$A=$C$2,ROW($B:$B),36500),ROW(E114)))&\"\")),\"\",VALUE(INDEX(信誉提升汇总记录表!E:E,SMALL(IF(信誉提升汇总记录表!$A:$A=$C$2,ROW($B:$B),36500),ROW(E114)))&\"\"))","v":""},{"$f":"INDEX(信誉提升汇总记录表!J:J,SMALL(IF(信誉提升汇总记录表!$A:$A=$C$2,ROW($B:$B),36500),ROW(F114)))&\"\"","v":""},{"$f":"INDEX(信誉提升汇总记录表!K:K,SMALL(IF(信誉提升汇总记录表!$A:$A=$C$2,ROW($B:$B),36500),ROW(G114)))&\"\"","v":""},{"$f":"INDEX(信誉提升汇总记录表!M:M,SMALL(IF(信誉提升汇总记录表!$A:$A=$C$2,ROW($B:$B),36500),ROW(H114)))&\"\"","v":""}]
[{"$f":"IF(B118=\"\",\"\",INDEX(信誉提升汇总记录表!B:B,SMALL(IF(信誉提升汇总记录表!$A:$A=$C$2,ROW($B:$B),36500),ROW(A115))))","v":""},{"$f":"INDEX(信誉提升汇总记录表!A:A,SMALL(IF(信誉提升汇总记录表!$A:$A=$C$2,ROW($B:$B),36500),ROW(B115)))&\"\"","v":""},{"$f":"INDEX(信誉提升汇总记录表!C:C,SMALL(IF(信誉提升汇总记录表!$A:$A=$C$2,ROW($B:$B),36500),ROW(C115)))&\"\"","v":""},{"$f":"INDEX(信誉提升汇总记录表!D:D,SMALL(IF(信誉提升汇总记录表!$A:$A=$C$2,ROW($B:$B),36500),ROW(D115)))&\"\"","v":""},{"$f":"IF(ISERROR(VALUE(INDEX(信誉提升汇总记录表!E:E,SMALL(IF(信誉提升汇总记录表!$A:$A=$C$2,ROW($B:$B),36500),ROW(E115)))&\"\")),\"\",VALUE(INDEX(信誉提升汇总记录表!E:E,SMALL(IF(信誉提升汇总记录表!$A:$A=$C$2,ROW($B:$B),36500),ROW(E115)))&\"\"))","v":""},{"$f":"INDEX(信誉提升汇总记录表!J:J,SMALL(IF(信誉提升汇总记录表!$A:$A=$C$2,ROW($B:$B),36500),ROW(F115)))&\"\"","v":""},{"$f":"INDEX(信誉提升汇总记录表!K:K,SMALL(IF(信誉提升汇总记录表!$A:$A=$C$2,ROW($B:$B),36500),ROW(G115)))&\"\"","v":""},{"$f":"INDEX(信誉提升汇总记录表!M:M,SMALL(IF(信誉提升汇总记录表!$A:$A=$C$2,ROW($B:$B),36500),ROW(H115)))&\"\"","v":""}]
[{"$f":"IF(B119=\"\",\"\",INDEX(信誉提升汇总记录表!B:B,SMALL(IF(信誉提升汇总记录表!$A:$A=$C$2,ROW($B:$B),36500),ROW(A116))))","v":""},{"$f":"INDEX(信誉提升汇总记录表!A:A,SMALL(IF(信誉提升汇总记录表!$A:$A=$C$2,ROW($B:$B),36500),ROW(B116)))&\"\"","v":""},{"$f":"INDEX(信誉提升汇总记录表!C:C,SMALL(IF(信誉提升汇总记录表!$A:$A=$C$2,ROW($B:$B),36500),ROW(C116)))&\"\"","v":""},{"$f":"INDEX(信誉提升汇总记录表!D:D,SMALL(IF(信誉提升汇总记录表!$A:$A=$C$2,ROW($B:$B),36500),ROW(D116)))&\"\"","v":""},{"$f":"IF(ISERROR(VALUE(INDEX(信誉提升汇总记录表!E:E,SMALL(IF(信誉提升汇总记录表!$A:$A=$C$2,ROW($B:$B),36500),ROW(E116)))&\"\")),\"\",VALUE(INDEX(信誉提升汇总记录表!E:E,SMALL(IF(信誉提升汇总记录表!$A:$A=$C$2,ROW($B:$B),36500),ROW(E116)))&\"\"))","v":""},{"$f":"INDEX(信誉提升汇总记录表!J:J,SMALL(IF(信誉提升汇总记录表!$A:$A=$C$2,ROW($B:$B),36500),ROW(F116)))&\"\"","v":""},{"$f":"INDEX(信誉提升汇总记录表!K:K,SMALL(IF(信誉提升汇总记录表!$A:$A=$C$2,ROW($B:$B),36500),ROW(G116)))&\"\"","v":""},{"$f":"INDEX(信誉提升汇总记录表!M:M,SMALL(IF(信誉提升汇总记录表!$A:$A=$C$2,ROW($B:$B),36500),ROW(H116)))&\"\"","v":""}]
[{"$f":"IF(B120=\"\",\"\",INDEX(信誉提升汇总记录表!B:B,SMALL(IF(信誉提升汇总记录表!$A:$A=$C$2,ROW($B:$B),36500),ROW(A117))))","v":""},{"$f":"INDEX(信誉提升汇总记录表!A:A,SMALL(IF(信誉提升汇总记录表!$A:$A=$C$2,ROW($B:$B),36500),ROW(B117)))&\"\"","v":""},{"$f":"INDEX(信誉提升汇总记录表!C:C,SMALL(IF(信誉提升汇总记录表!$A:$A=$C$2,ROW($B:$B),36500),ROW(C117)))&\"\"","v":""},{"$f":"INDEX(信誉提升汇总记录表!D:D,SMALL(IF(信誉提升汇总记录表!$A:$A=$C$2,ROW($B:$B),36500),ROW(D117)))&\"\"","v":""},{"$f":"IF(ISERROR(VALUE(INDEX(信誉提升汇总记录表!E:E,SMALL(IF(信誉提升汇总记录表!$A:$A=$C$2,ROW($B:$B),36500),ROW(E117)))&\"\")),\"\",VALUE(INDEX(信誉提升汇总记录表!E:E,SMALL(IF(信誉提升汇总记录表!$A:$A=$C$2,ROW($B:$B),36500),ROW(E117)))&\"\"))","v":""},{"$f":"INDEX(信誉提升汇总记录表!J:J,SMALL(IF(信誉提升汇总记录表!$A:$A=$C$2,ROW($B:$B),36500),ROW(F117)))&\"\"","v":""},{"$f":"INDEX(信誉提升汇总记录表!K:K,SMALL(IF(信誉提升汇总记录表!$A:$A=$C$2,ROW($B:$B),36500),ROW(G117)))&\"\"","v":""},{"$f":"INDEX(信誉提升汇总记录表!M:M,SMALL(IF(信誉提升汇总记录表!$A:$A=$C$2,ROW($B:$B),36500),ROW(H117)))&\"\"","v":""}]
[{"$f":"IF(B121=\"\",\"\",INDEX(信誉提升汇总记录表!B:B,SMALL(IF(信誉提升汇总记录表!$A:$A=$C$2,ROW($B:$B),36500),ROW(A118))))","v":""},{"$f":"INDEX(信誉提升汇总记录表!A:A,SMALL(IF(信誉提升汇总记录表!$A:$A=$C$2,ROW($B:$B),36500),ROW(B118)))&\"\"","v":""},{"$f":"INDEX(信誉提升汇总记录表!C:C,SMALL(IF(信誉提升汇总记录表!$A:$A=$C$2,ROW($B:$B),36500),ROW(C118)))&\"\"","v":""},{"$f":"INDEX(信誉提升汇总记录表!D:D,SMALL(IF(信誉提升汇总记录表!$A:$A=$C$2,ROW($B:$B),36500),ROW(D118)))&\"\"","v":""},{"$f":"IF(ISERROR(VALUE(INDEX(信誉提升汇总记录表!E:E,SMALL(IF(信誉提升汇总记录表!$A:$A=$C$2,ROW($B:$B),36500),ROW(E118)))&\"\")),\"\",VALUE(INDEX(信誉提升汇总记录表!E:E,SMALL(IF(信誉提升汇总记录表!$A:$A=$C$2,ROW($B:$B),36500),ROW(E118)))&\"\"))","v":""},{"$f":"INDEX(信誉提升汇总记录表!J:J,SMALL(IF(信誉提升汇总记录表!$A:$A=$C$2,ROW($B:$B),36500),ROW(F118)))&\"\"","v":""},{"$f":"INDEX(信誉提升汇总记录表!K:K,SMALL(IF(信誉提升汇总记录表!$A:$A=$C$2,ROW($B:$B),36500),ROW(G118)))&\"\"","v":""},{"$f":"INDEX(信誉提升汇总记录表!M:M,SMALL(IF(信誉提升汇总记录表!$A:$A=$C$2,ROW($B:$B),36500),ROW(H118)))&\"\"","v":""}]
[{"$f":"IF(B122=\"\",\"\",INDEX(信誉提升汇总记录表!B:B,SMALL(IF(信誉提升汇总记录表!$A:$A=$C$2,ROW($B:$B),36500),ROW(A119))))","v":""},{"$f":"INDEX(信誉提升汇总记录表!A:A,SMALL(IF(信誉提升汇总记录表!$A:$A=$C$2,ROW($B:$B),36500),ROW(B119)))&\"\"","v":""},{"$f":"INDEX(信誉提升汇总记录表!C:C,SMALL(IF(信誉提升汇总记录表!$A:$A=$C$2,ROW($B:$B),36500),ROW(C119)))&\"\"","v":""},{"$f":"INDEX(信誉提升汇总记录表!D:D,SMALL(IF(信誉提升汇总记录表!$A:$A=$C$2,ROW($B:$B),36500),ROW(D119)))&\"\"","v":""},{"$f":"IF(ISERROR(VALUE(INDEX(信誉提升汇总记录表!E:E,SMALL(IF(信誉提升汇总记录表!$A:$A=$C$2,ROW($B:$B),36500),ROW(E119)))&\"\")),\"\",VALUE(INDEX(信誉提升汇总记录表!E:E,SMALL(IF(信誉提升汇总记录表!$A:$A=$C$2,ROW($B:$B),36500),ROW(E119)))&\"\"))","v":""},{"$f":"INDEX(信誉提升汇总记录表!J:J,SMALL(IF(信誉提升汇总记录表!$A:$A=$C$2,ROW($B:$B),36500),ROW(F119)))&\"\"","v":""},{"$f":"INDEX(信誉提升汇总记录表!K:K,SMALL(IF(信誉提升汇总记录表!$A:$A=$C$2,ROW($B:$B),36500),ROW(G119)))&\"\"","v":""},{"$f":"INDEX(信誉提升汇总记录表!M:M,SMALL(IF(信誉提升汇总记录表!$A:$A=$C$2,ROW($B:$B),36500),ROW(H119)))&\"\"","v":""}]
[{"$f":"IF(B123=\"\",\"\",INDEX(信誉提升汇总记录表!B:B,SMALL(IF(信誉提升汇总记录表!$A:$A=$C$2,ROW($B:$B),36500),ROW(A120))))","v":""},{"$f":"INDEX(信誉提升汇总记录表!A:A,SMALL(IF(信誉提升汇总记录表!$A:$A=$C$2,ROW($B:$B),36500),ROW(B120)))&\"\"","v":""},{"$f":"INDEX(信誉提升汇总记录表!C:C,SMALL(IF(信誉提升汇总记录表!$A:$A=$C$2,ROW($B:$B),36500),ROW(C120)))&\"\"","v":""},{"$f":"INDEX(信誉提升汇总记录表!D:D,SMALL(IF(信誉提升汇总记录表!$A:$A=$C$2,ROW($B:$B),36500),ROW(D120)))&\"\"","v":""},{"$f":"IF(ISERROR(VALUE(INDEX(信誉提升汇总记录表!E:E,SMALL(IF(信誉提升汇总记录表!$A:$A=$C$2,ROW($B:$B),36500),ROW(E120)))&\"\")),\"\",VALUE(INDEX(信誉提升汇总记录表!E:E,SMALL(IF(信誉提升汇总记录表!$A:$A=$C$2,ROW($B:$B),36500),ROW(E120)))&\"\"))","v":""},{"$f":"INDEX(信誉提升汇总记录表!J:J,SMALL(IF(信誉提升汇总记录表!$A:$A=$C$2,ROW($B:$B),36500),ROW(F120)))&\"\"","v":""},{"$f":"INDEX(信誉提升汇总记录表!K:K,SMALL(IF(信誉提升汇总记录表!$A:$A=$C$2,ROW($B:$B),36500),ROW(G120)))&\"\"","v":""},{"$f":"INDEX(信誉提升汇总记录表!M:M,SMALL(IF(信誉提升汇总记录表!$A:$A=$C$2,ROW($B:$B),36500),ROW(H120)))&\"\"","v":""}]
[{"$f":"IF(B124=\"\",\"\",INDEX(信誉提升汇总记录表!B:B,SMALL(IF(信誉提升汇总记录表!$A:$A=$C$2,ROW($B:$B),36500),ROW(A121))))","v":""},{"$f":"INDEX(信誉提升汇总记录表!A:A,SMALL(IF(信誉提升汇总记录表!$A:$A=$C$2,ROW($B:$B),36500),ROW(B121)))&\"\"","v":""},{"$f":"INDEX(信誉提升汇总记录表!C:C,SMALL(IF(信誉提升汇总记录表!$A:$A=$C$2,ROW($B:$B),36500),ROW(C121)))&\"\"","v":""},{"$f":"INDEX(信誉提升汇总记录表!D:D,SMALL(IF(信誉提升汇总记录表!$A:$A=$C$2,ROW($B:$B),36500),ROW(D121)))&\"\"","v":""},{"$f":"IF(ISERROR(VALUE(INDEX(信誉提升汇总记录表!E:E,SMALL(IF(信誉提升汇总记录表!$A:$A=$C$2,ROW($B:$B),36500),ROW(E121)))&\"\")),\"\",VALUE(INDEX(信誉提升汇总记录表!E:E,SMALL(IF(信誉提升汇总记录表!$A:$A=$C$2,ROW($B:$B),36500),ROW(E121)))&\"\"))","v":""},{"$f":"INDEX(信誉提升汇总记录表!J:J,SMALL(IF(信誉提升汇总记录表!$A:$A=$C$2,ROW($B:$B),36500),ROW(F121)))&\"\"","v":""},{"$f":"INDEX(信誉提升汇总记录表!K:K,SMALL(IF(信誉提升汇总记录表!$A:$A=$C$2,ROW($B:$B),36500),ROW(G121)))&\"\"","v":""},{"$f":"INDEX(信誉提升汇总记录表!M:M,SMALL(IF(信誉提升汇总记录表!$A:$A=$C$2,ROW($B:$B),36500),ROW(H121)))&\"\"","v":""}]
[{"$f":"IF(B125=\"\",\"\",INDEX(信誉提升汇总记录表!B:B,SMALL(IF(信誉提升汇总记录表!$A:$A=$C$2,ROW($B:$B),36500),ROW(A122))))","v":""},{"$f":"INDEX(信誉提升汇总记录表!A:A,SMALL(IF(信誉提升汇总记录表!$A:$A=$C$2,ROW($B:$B),36500),ROW(B122)))&\"\"","v":""},{"$f":"INDEX(信誉提升汇总记录表!C:C,SMALL(IF(信誉提升汇总记录表!$A:$A=$C$2,ROW($B:$B),36500),ROW(C122)))&\"\"","v":""},{"$f":"INDEX(信誉提升汇总记录表!D:D,SMALL(IF(信誉提升汇总记录表!$A:$A=$C$2,ROW($B:$B),36500),ROW(D122)))&\"\"","v":""},{"$f":"IF(ISERROR(VALUE(INDEX(信誉提升汇总记录表!E:E,SMALL(IF(信誉提升汇总记录表!$A:$A=$C$2,ROW($B:$B),36500),ROW(E122)))&\"\")),\"\",VALUE(INDEX(信誉提升汇总记录表!E:E,SMALL(IF(信誉提升汇总记录表!$A:$A=$C$2,ROW($B:$B),36500),ROW(E122)))&\"\"))","v":""},{"$f":"INDEX(信誉提升汇总记录表!J:J,SMALL(IF(信誉提升汇总记录表!$A:$A=$C$2,ROW($B:$B),36500),ROW(F122)))&\"\"","v":""},{"$f":"INDEX(信誉提升汇总记录表!K:K,SMALL(IF(信誉提升汇总记录表!$A:$A=$C$2,ROW($B:$B),36500),ROW(G122)))&\"\"","v":""},{"$f":"INDEX(信誉提升汇总记录表!M:M,SMALL(IF(信誉提升汇总记录表!$A:$A=$C$2,ROW($B:$B),36500),ROW(H122)))&\"\"","v":""}]
[{"$f":"IF(B126=\"\",\"\",INDEX(信誉提升汇总记录表!B:B,SMALL(IF(信誉提升汇总记录表!$A:$A=$C$2,ROW($B:$B),36500),ROW(A123))))","v":""},{"$f":"INDEX(信誉提升汇总记录表!A:A,SMALL(IF(信誉提升汇总记录表!$A:$A=$C$2,ROW($B:$B),36500),ROW(B123)))&\"\"","v":""},{"$f":"INDEX(信誉提升汇总记录表!C:C,SMALL(IF(信誉提升汇总记录表!$A:$A=$C$2,ROW($B:$B),36500),ROW(C123)))&\"\"","v":""},{"$f":"INDEX(信誉提升汇总记录表!D:D,SMALL(IF(信誉提升汇总记录表!$A:$A=$C$2,ROW($B:$B),36500),ROW(D123)))&\"\"","v":""},{"$f":"IF(ISERROR(VALUE(INDEX(信誉提升汇总记录表!E:E,SMALL(IF(信誉提升汇总记录表!$A:$A=$C$2,ROW($B:$B),36500),ROW(E123)))&\"\")),\"\",VALUE(INDEX(信誉提升汇总记录表!E:E,SMALL(IF(信誉提升汇总记录表!$A:$A=$C$2,ROW($B:$B),36500),ROW(E123)))&\"\"))","v":""},{"$f":"INDEX(信誉提升汇总记录表!J:J,SMALL(IF(信誉提升汇总记录表!$A:$A=$C$2,ROW($B:$B),36500),ROW(F123)))&\"\"","v":""},{"$f":"INDEX(信誉提升汇总记录表!K:K,SMALL(IF(信誉提升汇总记录表!$A:$A=$C$2,ROW($B:$B),36500),ROW(G123)))&\"\"","v":""},{"$f":"INDEX(信誉提升汇总记录表!M:M,SMALL(IF(信誉提升汇总记录表!$A:$A=$C$2,ROW($B:$B),36500),ROW(H123)))&\"\"","v":""}]
[{"$f":"IF(B127=\"\",\"\",INDEX(信誉提升汇总记录表!B:B,SMALL(IF(信誉提升汇总记录表!$A:$A=$C$2,ROW($B:$B),36500),ROW(A124))))","v":""},{"$f":"INDEX(信誉提升汇总记录表!A:A,SMALL(IF(信誉提升汇总记录表!$A:$A=$C$2,ROW($B:$B),36500),ROW(B124)))&\"\"","v":""},{"$f":"INDEX(信誉提升汇总记录表!C:C,SMALL(IF(信誉提升汇总记录表!$A:$A=$C$2,ROW($B:$B),36500),ROW(C124)))&\"\"","v":""},{"$f":"INDEX(信誉提升汇总记录表!D:D,SMALL(IF(信誉提升汇总记录表!$A:$A=$C$2,ROW($B:$B),36500),ROW(D124)))&\"\"","v":""},{"$f":"IF(ISERROR(VALUE(INDEX(信誉提升汇总记录表!E:E,SMALL(IF(信誉提升汇总记录表!$A:$A=$C$2,ROW($B:$B),36500),ROW(E124)))&\"\")),\"\",VALUE(INDEX(信誉提升汇总记录表!E:E,SMALL(IF(信誉提升汇总记录表!$A:$A=$C$2,ROW($B:$B),36500),ROW(E124)))&\"\"))","v":""},{"$f":"INDEX(信誉提升汇总记录表!J:J,SMALL(IF(信誉提升汇总记录表!$A:$A=$C$2,ROW($B:$B),36500),ROW(F124)))&\"\"","v":""},{"$f":"INDEX(信誉提升汇总记录表!K:K,SMALL(IF(信誉提升汇总记录表!$A:$A=$C$2,ROW($B:$B),36500),ROW(G124)))&\"\"","v":""},{"$f":"INDEX(信誉提升汇总记录表!M:M,SMALL(IF(信誉提升汇总记录表!$A:$A=$C$2,ROW($B:$B),36500),ROW(H124)))&\"\"","v":""}]
[{"$f":"IF(B128=\"\",\"\",INDEX(信誉提升汇总记录表!B:B,SMALL(IF(信誉提升汇总记录表!$A:$A=$C$2,ROW($B:$B),36500),ROW(A125))))","v":""},{"$f":"INDEX(信誉提升汇总记录表!A:A,SMALL(IF(信誉提升汇总记录表!$A:$A=$C$2,ROW($B:$B),36500),ROW(B125)))&\"\"","v":""},{"$f":"INDEX(信誉提升汇总记录表!C:C,SMALL(IF(信誉提升汇总记录表!$A:$A=$C$2,ROW($B:$B),36500),ROW(C125)))&\"\"","v":""},{"$f":"INDEX(信誉提升汇总记录表!D:D,SMALL(IF(信誉提升汇总记录表!$A:$A=$C$2,ROW($B:$B),36500),ROW(D125)))&\"\"","v":""},{"$f":"IF(ISERROR(VALUE(INDEX(信誉提升汇总记录表!E:E,SMALL(IF(信誉提升汇总记录表!$A:$A=$C$2,ROW($B:$B),36500),ROW(E125)))&\"\")),\"\",VALUE(INDEX(信誉提升汇总记录表!E:E,SMALL(IF(信誉提升汇总记录表!$A:$A=$C$2,ROW($B:$B),36500),ROW(E125)))&\"\"))","v":""},{"$f":"INDEX(信誉提升汇总记录表!J:J,SMALL(IF(信誉提升汇总记录表!$A:$A=$C$2,ROW($B:$B),36500),ROW(F125)))&\"\"","v":""},{"$f":"INDEX(信誉提升汇总记录表!K:K,SMALL(IF(信誉提升汇总记录表!$A:$A=$C$2,ROW($B:$B),36500),ROW(G125)))&\"\"","v":""},{"$f":"INDEX(信誉提升汇总记录表!M:M,SMALL(IF(信誉提升汇总记录表!$A:$A=$C$2,ROW($B:$B),36500),ROW(H125)))&\"\"","v":""}]
[{"$f":"IF(B129=\"\",\"\",INDEX(信誉提升汇总记录表!B:B,SMALL(IF(信誉提升汇总记录表!$A:$A=$C$2,ROW($B:$B),36500),ROW(A126))))","v":""},{"$f":"INDEX(信誉提升汇总记录表!A:A,SMALL(IF(信誉提升汇总记录表!$A:$A=$C$2,ROW($B:$B),36500),ROW(B126)))&\"\"","v":""},{"$f":"INDEX(信誉提升汇总记录表!C:C,SMALL(IF(信誉提升汇总记录表!$A:$A=$C$2,ROW($B:$B),36500),ROW(C126)))&\"\"","v":""},{"$f":"INDEX(信誉提升汇总记录表!D:D,SMALL(IF(信誉提升汇总记录表!$A:$A=$C$2,ROW($B:$B),36500),ROW(D126)))&\"\"","v":""},{"$f":"IF(ISERROR(VALUE(INDEX(信誉提升汇总记录表!E:E,SMALL(IF(信誉提升汇总记录表!$A:$A=$C$2,ROW($B:$B),36500),ROW(E126)))&\"\")),\"\",VALUE(INDEX(信誉提升汇总记录表!E:E,SMALL(IF(信誉提升汇总记录表!$A:$A=$C$2,ROW($B:$B),36500),ROW(E126)))&\"\"))","v":""},{"$f":"INDEX(信誉提升汇总记录表!J:J,SMALL(IF(信誉提升汇总记录表!$A:$A=$C$2,ROW($B:$B),36500),ROW(F126)))&\"\"","v":""},{"$f":"INDEX(信誉提升汇总记录表!K:K,SMALL(IF(信誉提升汇总记录表!$A:$A=$C$2,ROW($B:$B),36500),ROW(G126)))&\"\"","v":""},{"$f":"INDEX(信誉提升汇总记录表!M:M,SMALL(IF(信誉提升汇总记录表!$A:$A=$C$2,ROW($B:$B),36500),ROW(H126)))&\"\"","v":""}]
[{"$f":"IF(B130=\"\",\"\",INDEX(信誉提升汇总记录表!B:B,SMALL(IF(信誉提升汇总记录表!$A:$A=$C$2,ROW($B:$B),36500),ROW(A127))))","v":""},{"$f":"INDEX(信誉提升汇总记录表!A:A,SMALL(IF(信誉提升汇总记录表!$A:$A=$C$2,ROW($B:$B),36500),ROW(B127)))&\"\"","v":""},{"$f":"INDEX(信誉提升汇总记录表!C:C,SMALL(IF(信誉提升汇总记录表!$A:$A=$C$2,ROW($B:$B),36500),ROW(C127)))&\"\"","v":""},{"$f":"INDEX(信誉提升汇总记录表!D:D,SMALL(IF(信誉提升汇总记录表!$A:$A=$C$2,ROW($B:$B),36500),ROW(D127)))&\"\"","v":""},{"$f":"IF(ISERROR(VALUE(INDEX(信誉提升汇总记录表!E:E,SMALL(IF(信誉提升汇总记录表!$A:$A=$C$2,ROW($B:$B),36500),ROW(E127)))&\"\")),\"\",VALUE(INDEX(信誉提升汇总记录表!E:E,SMALL(IF(信誉提升汇总记录表!$A:$A=$C$2,ROW($B:$B),36500),ROW(E127)))&\"\"))","v":""},{"$f":"INDEX(信誉提升汇总记录表!J:J,SMALL(IF(信誉提升汇总记录表!$A:$A=$C$2,ROW($B:$B),36500),ROW(F127)))&\"\"","v":""},{"$f":"INDEX(信誉提升汇总记录表!K:K,SMALL(IF(信誉提升汇总记录表!$A:$A=$C$2,ROW($B:$B),36500),ROW(G127)))&\"\"","v":""},{"$f":"INDEX(信誉提升汇总记录表!M:M,SMALL(IF(信誉提升汇总记录表!$A:$A=$C$2,ROW($B:$B),36500),ROW(H127)))&\"\"","v":""}]
[{"$f":"IF(B131=\"\",\"\",INDEX(信誉提升汇总记录表!B:B,SMALL(IF(信誉提升汇总记录表!$A:$A=$C$2,ROW($B:$B),36500),ROW(A128))))","v":""},{"$f":"INDEX(信誉提升汇总记录表!A:A,SMALL(IF(信誉提升汇总记录表!$A:$A=$C$2,ROW($B:$B),36500),ROW(B128)))&\"\"","v":""},{"$f":"INDEX(信誉提升汇总记录表!C:C,SMALL(IF(信誉提升汇总记录表!$A:$A=$C$2,ROW($B:$B),36500),ROW(C128)))&\"\"","v":""},{"$f":"INDEX(信誉提升汇总记录表!D:D,SMALL(IF(信誉提升汇总记录表!$A:$A=$C$2,ROW($B:$B),36500),ROW(D128)))&\"\"","v":""},{"$f":"IF(ISERROR(VALUE(INDEX(信誉提升汇总记录表!E:E,SMALL(IF(信誉提升汇总记录表!$A:$A=$C$2,ROW($B:$B),36500),ROW(E128)))&\"\")),\"\",VALUE(INDEX(信誉提升汇总记录表!E:E,SMALL(IF(信誉提升汇总记录表!$A:$A=$C$2,ROW($B:$B),36500),ROW(E128)))&\"\"))","v":""},{"$f":"INDEX(信誉提升汇总记录表!J:J,SMALL(IF(信誉提升汇总记录表!$A:$A=$C$2,ROW($B:$B),36500),ROW(F128)))&\"\"","v":""},{"$f":"INDEX(信誉提升汇总记录表!K:K,SMALL(IF(信誉提升汇总记录表!$A:$A=$C$2,ROW($B:$B),36500),ROW(G128)))&\"\"","v":""},{"$f":"INDEX(信誉提升汇总记录表!M:M,SMALL(IF(信誉提升汇总记录表!$A:$A=$C$2,ROW($B:$B),36500),ROW(H128)))&\"\"","v":""}]
[{"$f":"IF(B132=\"\",\"\",INDEX(信誉提升汇总记录表!B:B,SMALL(IF(信誉提升汇总记录表!$A:$A=$C$2,ROW($B:$B),36500),ROW(A129))))","v":""},{"$f":"INDEX(信誉提升汇总记录表!A:A,SMALL(IF(信誉提升汇总记录表!$A:$A=$C$2,ROW($B:$B),36500),ROW(B129)))&\"\"","v":""},{"$f":"INDEX(信誉提升汇总记录表!C:C,SMALL(IF(信誉提升汇总记录表!$A:$A=$C$2,ROW($B:$B),36500),ROW(C129)))&\"\"","v":""},{"$f":"INDEX(信誉提升汇总记录表!D:D,SMALL(IF(信誉提升汇总记录表!$A:$A=$C$2,ROW($B:$B),36500),ROW(D129)))&\"\"","v":""},{"$f":"IF(ISERROR(VALUE(INDEX(信誉提升汇总记录表!E:E,SMALL(IF(信誉提升汇总记录表!$A:$A=$C$2,ROW($B:$B),36500),ROW(E129)))&\"\")),\"\",VALUE(INDEX(信誉提升汇总记录表!E:E,SMALL(IF(信誉提升汇总记录表!$A:$A=$C$2,ROW($B:$B),36500),ROW(E129)))&\"\"))","v":""},{"$f":"INDEX(信誉提升汇总记录表!J:J,SMALL(IF(信誉提升汇总记录表!$A:$A=$C$2,ROW($B:$B),36500),ROW(F129)))&\"\"","v":""},{"$f":"INDEX(信誉提升汇总记录表!K:K,SMALL(IF(信誉提升汇总记录表!$A:$A=$C$2,ROW($B:$B),36500),ROW(G129)))&\"\"","v":""},{"$f":"INDEX(信誉提升汇总记录表!M:M,SMALL(IF(信誉提升汇总记录表!$A:$A=$C$2,ROW($B:$B),36500),ROW(H129)))&\"\"","v":""}]
[{"$f":"IF(B133=\"\",\"\",INDEX(信誉提升汇总记录表!B:B,SMALL(IF(信誉提升汇总记录表!$A:$A=$C$2,ROW($B:$B),36500),ROW(A130))))","v":""},{"$f":"INDEX(信誉提升汇总记录表!A:A,SMALL(IF(信誉提升汇总记录表!$A:$A=$C$2,ROW($B:$B),36500),ROW(B130)))&\"\"","v":""},{"$f":"INDEX(信誉提升汇总记录表!C:C,SMALL(IF(信誉提升汇总记录表!$A:$A=$C$2,ROW($B:$B),36500),ROW(C130)))&\"\"","v":""},{"$f":"INDEX(信誉提升汇总记录表!D:D,SMALL(IF(信誉提升汇总记录表!$A:$A=$C$2,ROW($B:$B),36500),ROW(D130)))&\"\"","v":""},{"$f":"IF(ISERROR(VALUE(INDEX(信誉提升汇总记录表!E:E,SMALL(IF(信誉提升汇总记录表!$A:$A=$C$2,ROW($B:$B),36500),ROW(E130)))&\"\")),\"\",VALUE(INDEX(信誉提升汇总记录表!E:E,SMALL(IF(信誉提升汇总记录表!$A:$A=$C$2,ROW($B:$B),36500),ROW(E130)))&\"\"))","v":""},{"$f":"INDEX(信誉提升汇总记录表!J:J,SMALL(IF(信誉提升汇总记录表!$A:$A=$C$2,ROW($B:$B),36500),ROW(F130)))&\"\"","v":""},{"$f":"INDEX(信誉提升汇总记录表!K:K,SMALL(IF(信誉提升汇总记录表!$A:$A=$C$2,ROW($B:$B),36500),ROW(G130)))&\"\"","v":""},{"$f":"INDEX(信誉提升汇总记录表!M:M,SMALL(IF(信誉提升汇总记录表!$A:$A=$C$2,ROW($B:$B),36500),ROW(H130)))&\"\"","v":""}]
[{"$f":"IF(B134=\"\",\"\",INDEX(信誉提升汇总记录表!B:B,SMALL(IF(信誉提升汇总记录表!$A:$A=$C$2,ROW($B:$B),36500),ROW(A131))))","v":""},{"$f":"INDEX(信誉提升汇总记录表!A:A,SMALL(IF(信誉提升汇总记录表!$A:$A=$C$2,ROW($B:$B),36500),ROW(B131)))&\"\"","v":""},{"$f":"INDEX(信誉提升汇总记录表!C:C,SMALL(IF(信誉提升汇总记录表!$A:$A=$C$2,ROW($B:$B),36500),ROW(C131)))&\"\"","v":""},{"$f":"INDEX(信誉提升汇总记录表!D:D,SMALL(IF(信誉提升汇总记录表!$A:$A=$C$2,ROW($B:$B),36500),ROW(D131)))&\"\"","v":""},{"$f":"IF(ISERROR(VALUE(INDEX(信誉提升汇总记录表!E:E,SMALL(IF(信誉提升汇总记录表!$A:$A=$C$2,ROW($B:$B),36500),ROW(E131)))&\"\")),\"\",VALUE(INDEX(信誉提升汇总记录表!E:E,SMALL(IF(信誉提升汇总记录表!$A:$A=$C$2,ROW($B:$B),36500),ROW(E131)))&\"\"))","v":""},{"$f":"INDEX(信誉提升汇总记录表!J:J,SMALL(IF(信誉提升汇总记录表!$A:$A=$C$2,ROW($B:$B),36500),ROW(F131)))&\"\"","v":""},{"$f":"INDEX(信誉提升汇总记录表!K:K,SMALL(IF(信誉提升汇总记录表!$A:$A=$C$2,ROW($B:$B),36500),ROW(G131)))&\"\"","v":""},{"$f":"INDEX(信誉提升汇总记录表!M:M,SMALL(IF(信誉提升汇总记录表!$A:$A=$C$2,ROW($B:$B),36500),ROW(H131)))&\"\"","v":""}]
[{"$f":"IF(B135=\"\",\"\",INDEX(信誉提升汇总记录表!B:B,SMALL(IF(信誉提升汇总记录表!$A:$A=$C$2,ROW($B:$B),36500),ROW(A132))))","v":""},{"$f":"INDEX(信誉提升汇总记录表!A:A,SMALL(IF(信誉提升汇总记录表!$A:$A=$C$2,ROW($B:$B),36500),ROW(B132)))&\"\"","v":""},{"$f":"INDEX(信誉提升汇总记录表!C:C,SMALL(IF(信誉提升汇总记录表!$A:$A=$C$2,ROW($B:$B),36500),ROW(C132)))&\"\"","v":""},{"$f":"INDEX(信誉提升汇总记录表!D:D,SMALL(IF(信誉提升汇总记录表!$A:$A=$C$2,ROW($B:$B),36500),ROW(D132)))&\"\"","v":""},{"$f":"IF(ISERROR(VALUE(INDEX(信誉提升汇总记录表!E:E,SMALL(IF(信誉提升汇总记录表!$A:$A=$C$2,ROW($B:$B),36500),ROW(E132)))&\"\")),\"\",VALUE(INDEX(信誉提升汇总记录表!E:E,SMALL(IF(信誉提升汇总记录表!$A:$A=$C$2,ROW($B:$B),36500),ROW(E132)))&\"\"))","v":""},{"$f":"INDEX(信誉提升汇总记录表!J:J,SMALL(IF(信誉提升汇总记录表!$A:$A=$C$2,ROW($B:$B),36500),ROW(F132)))&\"\"","v":""},{"$f":"INDEX(信誉提升汇总记录表!K:K,SMALL(IF(信誉提升汇总记录表!$A:$A=$C$2,ROW($B:$B),36500),ROW(G132)))&\"\"","v":""},{"$f":"INDEX(信誉提升汇总记录表!M:M,SMALL(IF(信誉提升汇总记录表!$A:$A=$C$2,ROW($B:$B),36500),ROW(H132)))&\"\"","v":""}]
[{"$f":"IF(B136=\"\",\"\",INDEX(信誉提升汇总记录表!B:B,SMALL(IF(信誉提升汇总记录表!$A:$A=$C$2,ROW($B:$B),36500),ROW(A133))))","v":""},{"$f":"INDEX(信誉提升汇总记录表!A:A,SMALL(IF(信誉提升汇总记录表!$A:$A=$C$2,ROW($B:$B),36500),ROW(B133)))&\"\"","v":""},{"$f":"INDEX(信誉提升汇总记录表!C:C,SMALL(IF(信誉提升汇总记录表!$A:$A=$C$2,ROW($B:$B),36500),ROW(C133)))&\"\"","v":""},{"$f":"INDEX(信誉提升汇总记录表!D:D,SMALL(IF(信誉提升汇总记录表!$A:$A=$C$2,ROW($B:$B),36500),ROW(D133)))&\"\"","v":""},{"$f":"IF(ISERROR(VALUE(INDEX(信誉提升汇总记录表!E:E,SMALL(IF(信誉提升汇总记录表!$A:$A=$C$2,ROW($B:$B),36500),ROW(E133)))&\"\")),\"\",VALUE(INDEX(信誉提升汇总记录表!E:E,SMALL(IF(信誉提升汇总记录表!$A:$A=$C$2,ROW($B:$B),36500),ROW(E133)))&\"\"))","v":""},{"$f":"INDEX(信誉提升汇总记录表!J:J,SMALL(IF(信誉提升汇总记录表!$A:$A=$C$2,ROW($B:$B),36500),ROW(F133)))&\"\"","v":""},{"$f":"INDEX(信誉提升汇总记录表!K:K,SMALL(IF(信誉提升汇总记录表!$A:$A=$C$2,ROW($B:$B),36500),ROW(G133)))&\"\"","v":""},{"$f":"INDEX(信誉提升汇总记录表!M:M,SMALL(IF(信誉提升汇总记录表!$A:$A=$C$2,ROW($B:$B),36500),ROW(H133)))&\"\"","v":""}]
[{"$f":"IF(B137=\"\",\"\",INDEX(信誉提升汇总记录表!B:B,SMALL(IF(信誉提升汇总记录表!$A:$A=$C$2,ROW($B:$B),36500),ROW(A134))))","v":""},{"$f":"INDEX(信誉提升汇总记录表!A:A,SMALL(IF(信誉提升汇总记录表!$A:$A=$C$2,ROW($B:$B),36500),ROW(B134)))&\"\"","v":""},{"$f":"INDEX(信誉提升汇总记录表!C:C,SMALL(IF(信誉提升汇总记录表!$A:$A=$C$2,ROW($B:$B),36500),ROW(C134)))&\"\"","v":""},{"$f":"INDEX(信誉提升汇总记录表!D:D,SMALL(IF(信誉提升汇总记录表!$A:$A=$C$2,ROW($B:$B),36500),ROW(D134)))&\"\"","v":""},{"$f":"IF(ISERROR(VALUE(INDEX(信誉提升汇总记录表!E:E,SMALL(IF(信誉提升汇总记录表!$A:$A=$C$2,ROW($B:$B),36500),ROW(E134)))&\"\")),\"\",VALUE(INDEX(信誉提升汇总记录表!E:E,SMALL(IF(信誉提升汇总记录表!$A:$A=$C$2,ROW($B:$B),36500),ROW(E134)))&\"\"))","v":""},{"$f":"INDEX(信誉提升汇总记录表!J:J,SMALL(IF(信誉提升汇总记录表!$A:$A=$C$2,ROW($B:$B),36500),ROW(F134)))&\"\"","v":""},{"$f":"INDEX(信誉提升汇总记录表!K:K,SMALL(IF(信誉提升汇总记录表!$A:$A=$C$2,ROW($B:$B),36500),ROW(G134)))&\"\"","v":""},{"$f":"INDEX(信誉提升汇总记录表!M:M,SMALL(IF(信誉提升汇总记录表!$A:$A=$C$2,ROW($B:$B),36500),ROW(H134)))&\"\"","v":""}]
[{"$f":"IF(B138=\"\",\"\",INDEX(信誉提升汇总记录表!B:B,SMALL(IF(信誉提升汇总记录表!$A:$A=$C$2,ROW($B:$B),36500),ROW(A135))))","v":""},{"$f":"INDEX(信誉提升汇总记录表!A:A,SMALL(IF(信誉提升汇总记录表!$A:$A=$C$2,ROW($B:$B),36500),ROW(B135)))&\"\"","v":""},{"$f":"INDEX(信誉提升汇总记录表!C:C,SMALL(IF(信誉提升汇总记录表!$A:$A=$C$2,ROW($B:$B),36500),ROW(C135)))&\"\"","v":""},{"$f":"INDEX(信誉提升汇总记录表!D:D,SMALL(IF(信誉提升汇总记录表!$A:$A=$C$2,ROW($B:$B),36500),ROW(D135)))&\"\"","v":""},{"$f":"IF(ISERROR(VALUE(INDEX(信誉提升汇总记录表!E:E,SMALL(IF(信誉提升汇总记录表!$A:$A=$C$2,ROW($B:$B),36500),ROW(E135)))&\"\")),\"\",VALUE(INDEX(信誉提升汇总记录表!E:E,SMALL(IF(信誉提升汇总记录表!$A:$A=$C$2,ROW($B:$B),36500),ROW(E135)))&\"\"))","v":""},{"$f":"INDEX(信誉提升汇总记录表!J:J,SMALL(IF(信誉提升汇总记录表!$A:$A=$C$2,ROW($B:$B),36500),ROW(F135)))&\"\"","v":""},{"$f":"INDEX(信誉提升汇总记录表!K:K,SMALL(IF(信誉提升汇总记录表!$A:$A=$C$2,ROW($B:$B),36500),ROW(G135)))&\"\"","v":""},{"$f":"INDEX(信誉提升汇总记录表!M:M,SMALL(IF(信誉提升汇总记录表!$A:$A=$C$2,ROW($B:$B),36500),ROW(H135)))&\"\"","v":""}]
[{"$f":"IF(B139=\"\",\"\",INDEX(信誉提升汇总记录表!B:B,SMALL(IF(信誉提升汇总记录表!$A:$A=$C$2,ROW($B:$B),36500),ROW(A136))))","v":""},{"$f":"INDEX(信誉提升汇总记录表!A:A,SMALL(IF(信誉提升汇总记录表!$A:$A=$C$2,ROW($B:$B),36500),ROW(B136)))&\"\"","v":""},{"$f":"INDEX(信誉提升汇总记录表!C:C,SMALL(IF(信誉提升汇总记录表!$A:$A=$C$2,ROW($B:$B),36500),ROW(C136)))&\"\"","v":""},{"$f":"INDEX(信誉提升汇总记录表!D:D,SMALL(IF(信誉提升汇总记录表!$A:$A=$C$2,ROW($B:$B),36500),ROW(D136)))&\"\"","v":""},{"$f":"IF(ISERROR(VALUE(INDEX(信誉提升汇总记录表!E:E,SMALL(IF(信誉提升汇总记录表!$A:$A=$C$2,ROW($B:$B),36500),ROW(E136)))&\"\")),\"\",VALUE(INDEX(信誉提升汇总记录表!E:E,SMALL(IF(信誉提升汇总记录表!$A:$A=$C$2,ROW($B:$B),36500),ROW(E136)))&\"\"))","v":""},{"$f":"INDEX(信誉提升汇总记录表!J:J,SMALL(IF(信誉提升汇总记录表!$A:$A=$C$2,ROW($B:$B),36500),ROW(F136)))&\"\"","v":""},{"$f":"INDEX(信誉提升汇总记录表!K:K,SMALL(IF(信誉提升汇总记录表!$A:$A=$C$2,ROW($B:$B),36500),ROW(G136)))&\"\"","v":""},{"$f":"INDEX(信誉提升汇总记录表!M:M,SMALL(IF(信誉提升汇总记录表!$A:$A=$C$2,ROW($B:$B),36500),ROW(H136)))&\"\"","v":""}]
[{"$f":"IF(B140=\"\",\"\",INDEX(信誉提升汇总记录表!B:B,SMALL(IF(信誉提升汇总记录表!$A:$A=$C$2,ROW($B:$B),36500),ROW(A137))))","v":""},{"$f":"INDEX(信誉提升汇总记录表!A:A,SMALL(IF(信誉提升汇总记录表!$A:$A=$C$2,ROW($B:$B),36500),ROW(B137)))&\"\"","v":""},{"$f":"INDEX(信誉提升汇总记录表!C:C,SMALL(IF(信誉提升汇总记录表!$A:$A=$C$2,ROW($B:$B),36500),ROW(C137)))&\"\"","v":""},{"$f":"INDEX(信誉提升汇总记录表!D:D,SMALL(IF(信誉提升汇总记录表!$A:$A=$C$2,ROW($B:$B),36500),ROW(D137)))&\"\"","v":""},{"$f":"IF(ISERROR(VALUE(INDEX(信誉提升汇总记录表!E:E,SMALL(IF(信誉提升汇总记录表!$A:$A=$C$2,ROW($B:$B),36500),ROW(E137)))&\"\")),\"\",VALUE(INDEX(信誉提升汇总记录表!E:E,SMALL(IF(信誉提升汇总记录表!$A:$A=$C$2,ROW($B:$B),36500),ROW(E137)))&\"\"))","v":""},{"$f":"INDEX(信誉提升汇总记录表!J:J,SMALL(IF(信誉提升汇总记录表!$A:$A=$C$2,ROW($B:$B),36500),ROW(F137)))&\"\"","v":""},{"$f":"INDEX(信誉提升汇总记录表!K:K,SMALL(IF(信誉提升汇总记录表!$A:$A=$C$2,ROW($B:$B),36500),ROW(G137)))&\"\"","v":""},{"$f":"INDEX(信誉提升汇总记录表!M:M,SMALL(IF(信誉提升汇总记录表!$A:$A=$C$2,ROW($B:$B),36500),ROW(H137)))&\"\"","v":""}]
[{"$f":"IF(B141=\"\",\"\",INDEX(信誉提升汇总记录表!B:B,SMALL(IF(信誉提升汇总记录表!$A:$A=$C$2,ROW($B:$B),36500),ROW(A138))))","v":""},{"$f":"INDEX(信誉提升汇总记录表!A:A,SMALL(IF(信誉提升汇总记录表!$A:$A=$C$2,ROW($B:$B),36500),ROW(B138)))&\"\"","v":""},{"$f":"INDEX(信誉提升汇总记录表!C:C,SMALL(IF(信誉提升汇总记录表!$A:$A=$C$2,ROW($B:$B),36500),ROW(C138)))&\"\"","v":""},{"$f":"INDEX(信誉提升汇总记录表!D:D,SMALL(IF(信誉提升汇总记录表!$A:$A=$C$2,ROW($B:$B),36500),ROW(D138)))&\"\"","v":""},{"$f":"IF(ISERROR(VALUE(INDEX(信誉提升汇总记录表!E:E,SMALL(IF(信誉提升汇总记录表!$A:$A=$C$2,ROW($B:$B),36500),ROW(E138)))&\"\")),\"\",VALUE(INDEX(信誉提升汇总记录表!E:E,SMALL(IF(信誉提升汇总记录表!$A:$A=$C$2,ROW($B:$B),36500),ROW(E138)))&\"\"))","v":""},{"$f":"INDEX(信誉提升汇总记录表!J:J,SMALL(IF(信誉提升汇总记录表!$A:$A=$C$2,ROW($B:$B),36500),ROW(F138)))&\"\"","v":""},{"$f":"INDEX(信誉提升汇总记录表!K:K,SMALL(IF(信誉提升汇总记录表!$A:$A=$C$2,ROW($B:$B),36500),ROW(G138)))&\"\"","v":""},{"$f":"INDEX(信誉提升汇总记录表!M:M,SMALL(IF(信誉提升汇总记录表!$A:$A=$C$2,ROW($B:$B),36500),ROW(H138)))&\"\"","v":""}]
[{"$f":"IF(B142=\"\",\"\",INDEX(信誉提升汇总记录表!B:B,SMALL(IF(信誉提升汇总记录表!$A:$A=$C$2,ROW($B:$B),36500),ROW(A139))))","v":""},{"$f":"INDEX(信誉提升汇总记录表!A:A,SMALL(IF(信誉提升汇总记录表!$A:$A=$C$2,ROW($B:$B),36500),ROW(B139)))&\"\"","v":""},{"$f":"INDEX(信誉提升汇总记录表!C:C,SMALL(IF(信誉提升汇总记录表!$A:$A=$C$2,ROW($B:$B),36500),ROW(C139)))&\"\"","v":""},{"$f":"INDEX(信誉提升汇总记录表!D:D,SMALL(IF(信誉提升汇总记录表!$A:$A=$C$2,ROW($B:$B),36500),ROW(D139)))&\"\"","v":""},{"$f":"IF(ISERROR(VALUE(INDEX(信誉提升汇总记录表!E:E,SMALL(IF(信誉提升汇总记录表!$A:$A=$C$2,ROW($B:$B),36500),ROW(E139)))&\"\")),\"\",VALUE(INDEX(信誉提升汇总记录表!E:E,SMALL(IF(信誉提升汇总记录表!$A:$A=$C$2,ROW($B:$B),36500),ROW(E139)))&\"\"))","v":""},{"$f":"INDEX(信誉提升汇总记录表!J:J,SMALL(IF(信誉提升汇总记录表!$A:$A=$C$2,ROW($B:$B),36500),ROW(F139)))&\"\"","v":""},{"$f":"INDEX(信誉提升汇总记录表!K:K,SMALL(IF(信誉提升汇总记录表!$A:$A=$C$2,ROW($B:$B),36500),ROW(G139)))&\"\"","v":""},{"$f":"INDEX(信誉提升汇总记录表!M:M,SMALL(IF(信誉提升汇总记录表!$A:$A=$C$2,ROW($B:$B),36500),ROW(H139)))&\"\"","v":""}]
[{"$f":"IF(B143=\"\",\"\",INDEX(信誉提升汇总记录表!B:B,SMALL(IF(信誉提升汇总记录表!$A:$A=$C$2,ROW($B:$B),36500),ROW(A140))))","v":""},{"$f":"INDEX(信誉提升汇总记录表!A:A,SMALL(IF(信誉提升汇总记录表!$A:$A=$C$2,ROW($B:$B),36500),ROW(B140)))&\"\"","v":""},{"$f":"INDEX(信誉提升汇总记录表!C:C,SMALL(IF(信誉提升汇总记录表!$A:$A=$C$2,ROW($B:$B),36500),ROW(C140)))&\"\"","v":""},{"$f":"INDEX(信誉提升汇总记录表!D:D,SMALL(IF(信誉提升汇总记录表!$A:$A=$C$2,ROW($B:$B),36500),ROW(D140)))&\"\"","v":""},{"$f":"IF(ISERROR(VALUE(INDEX(信誉提升汇总记录表!E:E,SMALL(IF(信誉提升汇总记录表!$A:$A=$C$2,ROW($B:$B),36500),ROW(E140)))&\"\")),\"\",VALUE(INDEX(信誉提升汇总记录表!E:E,SMALL(IF(信誉提升汇总记录表!$A:$A=$C$2,ROW($B:$B),36500),ROW(E140)))&\"\"))","v":""},{"$f":"INDEX(信誉提升汇总记录表!J:J,SMALL(IF(信誉提升汇总记录表!$A:$A=$C$2,ROW($B:$B),36500),ROW(F140)))&\"\"","v":""},{"$f":"INDEX(信誉提升汇总记录表!K:K,SMALL(IF(信誉提升汇总记录表!$A:$A=$C$2,ROW($B:$B),36500),ROW(G140)))&\"\"","v":""},{"$f":"INDEX(信誉提升汇总记录表!M:M,SMALL(IF(信誉提升汇总记录表!$A:$A=$C$2,ROW($B:$B),36500),ROW(H140)))&\"\"","v":""}]
[{"$f":"IF(B144=\"\",\"\",INDEX(信誉提升汇总记录表!B:B,SMALL(IF(信誉提升汇总记录表!$A:$A=$C$2,ROW($B:$B),36500),ROW(A141))))","v":""},{"$f":"INDEX(信誉提升汇总记录表!A:A,SMALL(IF(信誉提升汇总记录表!$A:$A=$C$2,ROW($B:$B),36500),ROW(B141)))&\"\"","v":""},{"$f":"INDEX(信誉提升汇总记录表!C:C,SMALL(IF(信誉提升汇总记录表!$A:$A=$C$2,ROW($B:$B),36500),ROW(C141)))&\"\"","v":""},{"$f":"INDEX(信誉提升汇总记录表!D:D,SMALL(IF(信誉提升汇总记录表!$A:$A=$C$2,ROW($B:$B),36500),ROW(D141)))&\"\"","v":""},{"$f":"IF(ISERROR(VALUE(INDEX(信誉提升汇总记录表!E:E,SMALL(IF(信誉提升汇总记录表!$A:$A=$C$2,ROW($B:$B),36500),ROW(E141)))&\"\")),\"\",VALUE(INDEX(信誉提升汇总记录表!E:E,SMALL(IF(信誉提升汇总记录表!$A:$A=$C$2,ROW($B:$B),36500),ROW(E141)))&\"\"))","v":""},{"$f":"INDEX(信誉提升汇总记录表!J:J,SMALL(IF(信誉提升汇总记录表!$A:$A=$C$2,ROW($B:$B),36500),ROW(F141)))&\"\"","v":""},{"$f":"INDEX(信誉提升汇总记录表!K:K,SMALL(IF(信誉提升汇总记录表!$A:$A=$C$2,ROW($B:$B),36500),ROW(G141)))&\"\"","v":""},{"$f":"INDEX(信誉提升汇总记录表!M:M,SMALL(IF(信誉提升汇总记录表!$A:$A=$C$2,ROW($B:$B),36500),ROW(H141)))&\"\"","v":""}]
[{"$f":"IF(B145=\"\",\"\",INDEX(信誉提升汇总记录表!B:B,SMALL(IF(信誉提升汇总记录表!$A:$A=$C$2,ROW($B:$B),36500),ROW(A142))))","v":""},{"$f":"INDEX(信誉提升汇总记录表!A:A,SMALL(IF(信誉提升汇总记录表!$A:$A=$C$2,ROW($B:$B),36500),ROW(B142)))&\"\"","v":""},{"$f":"INDEX(信誉提升汇总记录表!C:C,SMALL(IF(信誉提升汇总记录表!$A:$A=$C$2,ROW($B:$B),36500),ROW(C142)))&\"\"","v":""},{"$f":"INDEX(信誉提升汇总记录表!D:D,SMALL(IF(信誉提升汇总记录表!$A:$A=$C$2,ROW($B:$B),36500),ROW(D142)))&\"\"","v":""},{"$f":"IF(ISERROR(VALUE(INDEX(信誉提升汇总记录表!E:E,SMALL(IF(信誉提升汇总记录表!$A:$A=$C$2,ROW($B:$B),36500),ROW(E142)))&\"\")),\"\",VALUE(INDEX(信誉提升汇总记录表!E:E,SMALL(IF(信誉提升汇总记录表!$A:$A=$C$2,ROW($B:$B),36500),ROW(E142)))&\"\"))","v":""},{"$f":"INDEX(信誉提升汇总记录表!J:J,SMALL(IF(信誉提升汇总记录表!$A:$A=$C$2,ROW($B:$B),36500),ROW(F142)))&\"\"","v":""},{"$f":"INDEX(信誉提升汇总记录表!K:K,SMALL(IF(信誉提升汇总记录表!$A:$A=$C$2,ROW($B:$B),36500),ROW(G142)))&\"\"","v":""},{"$f":"INDEX(信誉提升汇总记录表!M:M,SMALL(IF(信誉提升汇总记录表!$A:$A=$C$2,ROW($B:$B),36500),ROW(H142)))&\"\"","v":""}]
[{"$f":"IF(B146=\"\",\"\",INDEX(信誉提升汇总记录表!B:B,SMALL(IF(信誉提升汇总记录表!$A:$A=$C$2,ROW($B:$B),36500),ROW(A143))))","v":""},{"$f":"INDEX(信誉提升汇总记录表!A:A,SMALL(IF(信誉提升汇总记录表!$A:$A=$C$2,ROW($B:$B),36500),ROW(B143)))&\"\"","v":""},{"$f":"INDEX(信誉提升汇总记录表!C:C,SMALL(IF(信誉提升汇总记录表!$A:$A=$C$2,ROW($B:$B),36500),ROW(C143)))&\"\"","v":""},{"$f":"INDEX(信誉提升汇总记录表!D:D,SMALL(IF(信誉提升汇总记录表!$A:$A=$C$2,ROW($B:$B),36500),ROW(D143)))&\"\"","v":""},{"$f":"IF(ISERROR(VALUE(INDEX(信誉提升汇总记录表!E:E,SMALL(IF(信誉提升汇总记录表!$A:$A=$C$2,ROW($B:$B),36500),ROW(E143)))&\"\")),\"\",VALUE(INDEX(信誉提升汇总记录表!E:E,SMALL(IF(信誉提升汇总记录表!$A:$A=$C$2,ROW($B:$B),36500),ROW(E143)))&\"\"))","v":""},{"$f":"INDEX(信誉提升汇总记录表!J:J,SMALL(IF(信誉提升汇总记录表!$A:$A=$C$2,ROW($B:$B),36500),ROW(F143)))&\"\"","v":""},{"$f":"INDEX(信誉提升汇总记录表!K:K,SMALL(IF(信誉提升汇总记录表!$A:$A=$C$2,ROW($B:$B),36500),ROW(G143)))&\"\"","v":""},{"$f":"INDEX(信誉提升汇总记录表!M:M,SMALL(IF(信誉提升汇总记录表!$A:$A=$C$2,ROW($B:$B),36500),ROW(H143)))&\"\"","v":""}]
[{"$f":"IF(B147=\"\",\"\",INDEX(信誉提升汇总记录表!B:B,SMALL(IF(信誉提升汇总记录表!$A:$A=$C$2,ROW($B:$B),36500),ROW(A144))))","v":""},{"$f":"INDEX(信誉提升汇总记录表!A:A,SMALL(IF(信誉提升汇总记录表!$A:$A=$C$2,ROW($B:$B),36500),ROW(B144)))&\"\"","v":""},{"$f":"INDEX(信誉提升汇总记录表!C:C,SMALL(IF(信誉提升汇总记录表!$A:$A=$C$2,ROW($B:$B),36500),ROW(C144)))&\"\"","v":""},{"$f":"INDEX(信誉提升汇总记录表!D:D,SMALL(IF(信誉提升汇总记录表!$A:$A=$C$2,ROW($B:$B),36500),ROW(D144)))&\"\"","v":""},{"$f":"IF(ISERROR(VALUE(INDEX(信誉提升汇总记录表!E:E,SMALL(IF(信誉提升汇总记录表!$A:$A=$C$2,ROW($B:$B),36500),ROW(E144)))&\"\")),\"\",VALUE(INDEX(信誉提升汇总记录表!E:E,SMALL(IF(信誉提升汇总记录表!$A:$A=$C$2,ROW($B:$B),36500),ROW(E144)))&\"\"))","v":""},{"$f":"INDEX(信誉提升汇总记录表!J:J,SMALL(IF(信誉提升汇总记录表!$A:$A=$C$2,ROW($B:$B),36500),ROW(F144)))&\"\"","v":""},{"$f":"INDEX(信誉提升汇总记录表!K:K,SMALL(IF(信誉提升汇总记录表!$A:$A=$C$2,ROW($B:$B),36500),ROW(G144)))&\"\"","v":""},{"$f":"INDEX(信誉提升汇总记录表!M:M,SMALL(IF(信誉提升汇总记录表!$A:$A=$C$2,ROW($B:$B),36500),ROW(H144)))&\"\"","v":""}]
[{"$f":"IF(B148=\"\",\"\",INDEX(信誉提升汇总记录表!B:B,SMALL(IF(信誉提升汇总记录表!$A:$A=$C$2,ROW($B:$B),36500),ROW(A145))))","v":""},{"$f":"INDEX(信誉提升汇总记录表!A:A,SMALL(IF(信誉提升汇总记录表!$A:$A=$C$2,ROW($B:$B),36500),ROW(B145)))&\"\"","v":""},{"$f":"INDEX(信誉提升汇总记录表!C:C,SMALL(IF(信誉提升汇总记录表!$A:$A=$C$2,ROW($B:$B),36500),ROW(C145)))&\"\"","v":""},{"$f":"INDEX(信誉提升汇总记录表!D:D,SMALL(IF(信誉提升汇总记录表!$A:$A=$C$2,ROW($B:$B),36500),ROW(D145)))&\"\"","v":""},{"$f":"IF(ISERROR(VALUE(INDEX(信誉提升汇总记录表!E:E,SMALL(IF(信誉提升汇总记录表!$A:$A=$C$2,ROW($B:$B),36500),ROW(E145)))&\"\")),\"\",VALUE(INDEX(信誉提升汇总记录表!E:E,SMALL(IF(信誉提升汇总记录表!$A:$A=$C$2,ROW($B:$B),36500),ROW(E145)))&\"\"))","v":""},{"$f":"INDEX(信誉提升汇总记录表!J:J,SMALL(IF(信誉提升汇总记录表!$A:$A=$C$2,ROW($B:$B),36500),ROW(F145)))&\"\"","v":""},{"$f":"INDEX(信誉提升汇总记录表!K:K,SMALL(IF(信誉提升汇总记录表!$A:$A=$C$2,ROW($B:$B),36500),ROW(G145)))&\"\"","v":""},{"$f":"INDEX(信誉提升汇总记录表!M:M,SMALL(IF(信誉提升汇总记录表!$A:$A=$C$2,ROW($B:$B),36500),ROW(H145)))&\"\"","v":""}]
[{"$f":"IF(B149=\"\",\"\",INDEX(信誉提升汇总记录表!B:B,SMALL(IF(信誉提升汇总记录表!$A:$A=$C$2,ROW($B:$B),36500),ROW(A146))))","v":""},{"$f":"INDEX(信誉提升汇总记录表!A:A,SMALL(IF(信誉提升汇总记录表!$A:$A=$C$2,ROW($B:$B),36500),ROW(B146)))&\"\"","v":""},{"$f":"INDEX(信誉提升汇总记录表!C:C,SMALL(IF(信誉提升汇总记录表!$A:$A=$C$2,ROW($B:$B),36500),ROW(C146)))&\"\"","v":""},{"$f":"INDEX(信誉提升汇总记录表!D:D,SMALL(IF(信誉提升汇总记录表!$A:$A=$C$2,ROW($B:$B),36500),ROW(D146)))&\"\"","v":""},{"$f":"IF(ISERROR(VALUE(INDEX(信誉提升汇总记录表!E:E,SMALL(IF(信誉提升汇总记录表!$A:$A=$C$2,ROW($B:$B),36500),ROW(E146)))&\"\")),\"\",VALUE(INDEX(信誉提升汇总记录表!E:E,SMALL(IF(信誉提升汇总记录表!$A:$A=$C$2,ROW($B:$B),36500),ROW(E146)))&\"\"))","v":""},{"$f":"INDEX(信誉提升汇总记录表!J:J,SMALL(IF(信誉提升汇总记录表!$A:$A=$C$2,ROW($B:$B),36500),ROW(F146)))&\"\"","v":""},{"$f":"INDEX(信誉提升汇总记录表!K:K,SMALL(IF(信誉提升汇总记录表!$A:$A=$C$2,ROW($B:$B),36500),ROW(G146)))&\"\"","v":""},{"$f":"INDEX(信誉提升汇总记录表!M:M,SMALL(IF(信誉提升汇总记录表!$A:$A=$C$2,ROW($B:$B),36500),ROW(H146)))&\"\"","v":""}]
[{"$f":"IF(B150=\"\",\"\",INDEX(信誉提升汇总记录表!B:B,SMALL(IF(信誉提升汇总记录表!$A:$A=$C$2,ROW($B:$B),36500),ROW(A147))))","v":""},{"$f":"INDEX(信誉提升汇总记录表!A:A,SMALL(IF(信誉提升汇总记录表!$A:$A=$C$2,ROW($B:$B),36500),ROW(B147)))&\"\"","v":""},{"$f":"INDEX(信誉提升汇总记录表!C:C,SMALL(IF(信誉提升汇总记录表!$A:$A=$C$2,ROW($B:$B),36500),ROW(C147)))&\"\"","v":""},{"$f":"INDEX(信誉提升汇总记录表!D:D,SMALL(IF(信誉提升汇总记录表!$A:$A=$C$2,ROW($B:$B),36500),ROW(D147)))&\"\"","v":""},{"$f":"IF(ISERROR(VALUE(INDEX(信誉提升汇总记录表!E:E,SMALL(IF(信誉提升汇总记录表!$A:$A=$C$2,ROW($B:$B),36500),ROW(E147)))&\"\")),\"\",VALUE(INDEX(信誉提升汇总记录表!E:E,SMALL(IF(信誉提升汇总记录表!$A:$A=$C$2,ROW($B:$B),36500),ROW(E147)))&\"\"))","v":""},{"$f":"INDEX(信誉提升汇总记录表!J:J,SMALL(IF(信誉提升汇总记录表!$A:$A=$C$2,ROW($B:$B),36500),ROW(F147)))&\"\"","v":""},{"$f":"INDEX(信誉提升汇总记录表!K:K,SMALL(IF(信誉提升汇总记录表!$A:$A=$C$2,ROW($B:$B),36500),ROW(G147)))&\"\"","v":""},{"$f":"INDEX(信誉提升汇总记录表!M:M,SMALL(IF(信誉提升汇总记录表!$A:$A=$C$2,ROW($B:$B),36500),ROW(H147)))&\"\"","v":""}]
[{"$f":"IF(B151=\"\",\"\",INDEX(信誉提升汇总记录表!B:B,SMALL(IF(信誉提升汇总记录表!$A:$A=$C$2,ROW($B:$B),36500),ROW(A148))))","v":""},{"$f":"INDEX(信誉提升汇总记录表!A:A,SMALL(IF(信誉提升汇总记录表!$A:$A=$C$2,ROW($B:$B),36500),ROW(B148)))&\"\"","v":""},{"$f":"INDEX(信誉提升汇总记录表!C:C,SMALL(IF(信誉提升汇总记录表!$A:$A=$C$2,ROW($B:$B),36500),ROW(C148)))&\"\"","v":""},{"$f":"INDEX(信誉提升汇总记录表!D:D,SMALL(IF(信誉提升汇总记录表!$A:$A=$C$2,ROW($B:$B),36500),ROW(D148)))&\"\"","v":""},{"$f":"IF(ISERROR(VALUE(INDEX(信誉提升汇总记录表!E:E,SMALL(IF(信誉提升汇总记录表!$A:$A=$C$2,ROW($B:$B),36500),ROW(E148)))&\"\")),\"\",VALUE(INDEX(信誉提升汇总记录表!E:E,SMALL(IF(信誉提升汇总记录表!$A:$A=$C$2,ROW($B:$B),36500),ROW(E148)))&\"\"))","v":""},{"$f":"INDEX(信誉提升汇总记录表!J:J,SMALL(IF(信誉提升汇总记录表!$A:$A=$C$2,ROW($B:$B),36500),ROW(F148)))&\"\"","v":""},{"$f":"INDEX(信誉提升汇总记录表!K:K,SMALL(IF(信誉提升汇总记录表!$A:$A=$C$2,ROW($B:$B),36500),ROW(G148)))&\"\"","v":""},{"$f":"INDEX(信誉提升汇总记录表!M:M,SMALL(IF(信誉提升汇总记录表!$A:$A=$C$2,ROW($B:$B),36500),ROW(H148)))&\"\"","v":""}]
[{"$f":"IF(B152=\"\",\"\",INDEX(信誉提升汇总记录表!B:B,SMALL(IF(信誉提升汇总记录表!$A:$A=$C$2,ROW($B:$B),36500),ROW(A149))))","v":""},{"$f":"INDEX(信誉提升汇总记录表!A:A,SMALL(IF(信誉提升汇总记录表!$A:$A=$C$2,ROW($B:$B),36500),ROW(B149)))&\"\"","v":""},{"$f":"INDEX(信誉提升汇总记录表!C:C,SMALL(IF(信誉提升汇总记录表!$A:$A=$C$2,ROW($B:$B),36500),ROW(C149)))&\"\"","v":""},{"$f":"INDEX(信誉提升汇总记录表!D:D,SMALL(IF(信誉提升汇总记录表!$A:$A=$C$2,ROW($B:$B),36500),ROW(D149)))&\"\"","v":""},{"$f":"IF(ISERROR(VALUE(INDEX(信誉提升汇总记录表!E:E,SMALL(IF(信誉提升汇总记录表!$A:$A=$C$2,ROW($B:$B),36500),ROW(E149)))&\"\")),\"\",VALUE(INDEX(信誉提升汇总记录表!E:E,SMALL(IF(信誉提升汇总记录表!$A:$A=$C$2,ROW($B:$B),36500),ROW(E149)))&\"\"))","v":""},{"$f":"INDEX(信誉提升汇总记录表!J:J,SMALL(IF(信誉提升汇总记录表!$A:$A=$C$2,ROW($B:$B),36500),ROW(F149)))&\"\"","v":""},{"$f":"INDEX(信誉提升汇总记录表!K:K,SMALL(IF(信誉提升汇总记录表!$A:$A=$C$2,ROW($B:$B),36500),ROW(G149)))&\"\"","v":""},{"$f":"INDEX(信誉提升汇总记录表!M:M,SMALL(IF(信誉提升汇总记录表!$A:$A=$C$2,ROW($B:$B),36500),ROW(H149)))&\"\"","v":""}]
[{"$f":"IF(B153=\"\",\"\",INDEX(信誉提升汇总记录表!B:B,SMALL(IF(信誉提升汇总记录表!$A:$A=$C$2,ROW($B:$B),36500),ROW(A150))))","v":""},{"$f":"INDEX(信誉提升汇总记录表!A:A,SMALL(IF(信誉提升汇总记录表!$A:$A=$C$2,ROW($B:$B),36500),ROW(B150)))&\"\"","v":""},{"$f":"INDEX(信誉提升汇总记录表!C:C,SMALL(IF(信誉提升汇总记录表!$A:$A=$C$2,ROW($B:$B),36500),ROW(C150)))&\"\"","v":""},{"$f":"INDEX(信誉提升汇总记录表!D:D,SMALL(IF(信誉提升汇总记录表!$A:$A=$C$2,ROW($B:$B),36500),ROW(D150)))&\"\"","v":""},{"$f":"IF(ISERROR(VALUE(INDEX(信誉提升汇总记录表!E:E,SMALL(IF(信誉提升汇总记录表!$A:$A=$C$2,ROW($B:$B),36500),ROW(E150)))&\"\")),\"\",VALUE(INDEX(信誉提升汇总记录表!E:E,SMALL(IF(信誉提升汇总记录表!$A:$A=$C$2,ROW($B:$B),36500),ROW(E150)))&\"\"))","v":""},{"$f":"INDEX(信誉提升汇总记录表!J:J,SMALL(IF(信誉提升汇总记录表!$A:$A=$C$2,ROW($B:$B),36500),ROW(F150)))&\"\"","v":""},{"$f":"INDEX(信誉提升汇总记录表!K:K,SMALL(IF(信誉提升汇总记录表!$A:$A=$C$2,ROW($B:$B),36500),ROW(G150)))&\"\"","v":""},{"$f":"INDEX(信誉提升汇总记录表!M:M,SMALL(IF(信誉提升汇总记录表!$A:$A=$C$2,ROW($B:$B),36500),ROW(H150)))&\"\"","v":""}]
[{"$f":"IF(B154=\"\",\"\",INDEX(信誉提升汇总记录表!B:B,SMALL(IF(信誉提升汇总记录表!$A:$A=$C$2,ROW($B:$B),36500),ROW(A151))))","v":""},{"$f":"INDEX(信誉提升汇总记录表!A:A,SMALL(IF(信誉提升汇总记录表!$A:$A=$C$2,ROW($B:$B),36500),ROW(B151)))&\"\"","v":""},{"$f":"INDEX(信誉提升汇总记录表!C:C,SMALL(IF(信誉提升汇总记录表!$A:$A=$C$2,ROW($B:$B),36500),ROW(C151)))&\"\"","v":""},{"$f":"INDEX(信誉提升汇总记录表!D:D,SMALL(IF(信誉提升汇总记录表!$A:$A=$C$2,ROW($B:$B),36500),ROW(D151)))&\"\"","v":""},{"$f":"IF(ISERROR(VALUE(INDEX(信誉提升汇总记录表!E:E,SMALL(IF(信誉提升汇总记录表!$A:$A=$C$2,ROW($B:$B),36500),ROW(E151)))&\"\")),\"\",VALUE(INDEX(信誉提升汇总记录表!E:E,SMALL(IF(信誉提升汇总记录表!$A:$A=$C$2,ROW($B:$B),36500),ROW(E151)))&\"\"))","v":""},{"$f":"INDEX(信誉提升汇总记录表!J:J,SMALL(IF(信誉提升汇总记录表!$A:$A=$C$2,ROW($B:$B),36500),ROW(F151)))&\"\"","v":""},{"$f":"INDEX(信誉提升汇总记录表!K:K,SMALL(IF(信誉提升汇总记录表!$A:$A=$C$2,ROW($B:$B),36500),ROW(G151)))&\"\"","v":""},{"$f":"INDEX(信誉提升汇总记录表!M:M,SMALL(IF(信誉提升汇总记录表!$A:$A=$C$2,ROW($B:$B),36500),ROW(H151)))&\"\"","v":""}]
[{"$f":"IF(B155=\"\",\"\",INDEX(信誉提升汇总记录表!B:B,SMALL(IF(信誉提升汇总记录表!$A:$A=$C$2,ROW($B:$B),36500),ROW(A152))))","v":""},{"$f":"INDEX(信誉提升汇总记录表!A:A,SMALL(IF(信誉提升汇总记录表!$A:$A=$C$2,ROW($B:$B),36500),ROW(B152)))&\"\"","v":""},{"$f":"INDEX(信誉提升汇总记录表!C:C,SMALL(IF(信誉提升汇总记录表!$A:$A=$C$2,ROW($B:$B),36500),ROW(C152)))&\"\"","v":""},{"$f":"INDEX(信誉提升汇总记录表!D:D,SMALL(IF(信誉提升汇总记录表!$A:$A=$C$2,ROW($B:$B),36500),ROW(D152)))&\"\"","v":""},{"$f":"IF(ISERROR(VALUE(INDEX(信誉提升汇总记录表!E:E,SMALL(IF(信誉提升汇总记录表!$A:$A=$C$2,ROW($B:$B),36500),ROW(E152)))&\"\")),\"\",VALUE(INDEX(信誉提升汇总记录表!E:E,SMALL(IF(信誉提升汇总记录表!$A:$A=$C$2,ROW($B:$B),36500),ROW(E152)))&\"\"))","v":""},{"$f":"INDEX(信誉提升汇总记录表!J:J,SMALL(IF(信誉提升汇总记录表!$A:$A=$C$2,ROW($B:$B),36500),ROW(F152)))&\"\"","v":""},{"$f":"INDEX(信誉提升汇总记录表!K:K,SMALL(IF(信誉提升汇总记录表!$A:$A=$C$2,ROW($B:$B),36500),ROW(G152)))&\"\"","v":""},{"$f":"INDEX(信誉提升汇总记录表!M:M,SMALL(IF(信誉提升汇总记录表!$A:$A=$C$2,ROW($B:$B),36500),ROW(H152)))&\"\"","v":""}]
[{"$f":"IF(B156=\"\",\"\",INDEX(信誉提升汇总记录表!B:B,SMALL(IF(信誉提升汇总记录表!$A:$A=$C$2,ROW($B:$B),36500),ROW(A153))))","v":""},{"$f":"INDEX(信誉提升汇总记录表!A:A,SMALL(IF(信誉提升汇总记录表!$A:$A=$C$2,ROW($B:$B),36500),ROW(B153)))&\"\"","v":""},{"$f":"INDEX(信誉提升汇总记录表!C:C,SMALL(IF(信誉提升汇总记录表!$A:$A=$C$2,ROW($B:$B),36500),ROW(C153)))&\"\"","v":""},{"$f":"INDEX(信誉提升汇总记录表!D:D,SMALL(IF(信誉提升汇总记录表!$A:$A=$C$2,ROW($B:$B),36500),ROW(D153)))&\"\"","v":""},{"$f":"IF(ISERROR(VALUE(INDEX(信誉提升汇总记录表!E:E,SMALL(IF(信誉提升汇总记录表!$A:$A=$C$2,ROW($B:$B),36500),ROW(E153)))&\"\")),\"\",VALUE(INDEX(信誉提升汇总记录表!E:E,SMALL(IF(信誉提升汇总记录表!$A:$A=$C$2,ROW($B:$B),36500),ROW(E153)))&\"\"))","v":""},{"$f":"INDEX(信誉提升汇总记录表!J:J,SMALL(IF(信誉提升汇总记录表!$A:$A=$C$2,ROW($B:$B),36500),ROW(F153)))&\"\"","v":""},{"$f":"INDEX(信誉提升汇总记录表!K:K,SMALL(IF(信誉提升汇总记录表!$A:$A=$C$2,ROW($B:$B),36500),ROW(G153)))&\"\"","v":""},{"$f":"INDEX(信誉提升汇总记录表!M:M,SMALL(IF(信誉提升汇总记录表!$A:$A=$C$2,ROW($B:$B),36500),ROW(H153)))&\"\"","v":""}]
[{"$f":"IF(B157=\"\",\"\",INDEX(信誉提升汇总记录表!B:B,SMALL(IF(信誉提升汇总记录表!$A:$A=$C$2,ROW($B:$B),36500),ROW(A154))))","v":""},{"$f":"INDEX(信誉提升汇总记录表!A:A,SMALL(IF(信誉提升汇总记录表!$A:$A=$C$2,ROW($B:$B),36500),ROW(B154)))&\"\"","v":""},{"$f":"INDEX(信誉提升汇总记录表!C:C,SMALL(IF(信誉提升汇总记录表!$A:$A=$C$2,ROW($B:$B),36500),ROW(C154)))&\"\"","v":""},{"$f":"INDEX(信誉提升汇总记录表!D:D,SMALL(IF(信誉提升汇总记录表!$A:$A=$C$2,ROW($B:$B),36500),ROW(D154)))&\"\"","v":""},{"$f":"IF(ISERROR(VALUE(INDEX(信誉提升汇总记录表!E:E,SMALL(IF(信誉提升汇总记录表!$A:$A=$C$2,ROW($B:$B),36500),ROW(E154)))&\"\")),\"\",VALUE(INDEX(信誉提升汇总记录表!E:E,SMALL(IF(信誉提升汇总记录表!$A:$A=$C$2,ROW($B:$B),36500),ROW(E154)))&\"\"))","v":""},{"$f":"INDEX(信誉提升汇总记录表!J:J,SMALL(IF(信誉提升汇总记录表!$A:$A=$C$2,ROW($B:$B),36500),ROW(F154)))&\"\"","v":""},{"$f":"INDEX(信誉提升汇总记录表!K:K,SMALL(IF(信誉提升汇总记录表!$A:$A=$C$2,ROW($B:$B),36500),ROW(G154)))&\"\"","v":""},{"$f":"INDEX(信誉提升汇总记录表!M:M,SMALL(IF(信誉提升汇总记录表!$A:$A=$C$2,ROW($B:$B),36500),ROW(H154)))&\"\"","v":""}]
[{"$f":"IF(B158=\"\",\"\",INDEX(信誉提升汇总记录表!B:B,SMALL(IF(信誉提升汇总记录表!$A:$A=$C$2,ROW($B:$B),36500),ROW(A155))))","v":""},{"$f":"INDEX(信誉提升汇总记录表!A:A,SMALL(IF(信誉提升汇总记录表!$A:$A=$C$2,ROW($B:$B),36500),ROW(B155)))&\"\"","v":""},{"$f":"INDEX(信誉提升汇总记录表!C:C,SMALL(IF(信誉提升汇总记录表!$A:$A=$C$2,ROW($B:$B),36500),ROW(C155)))&\"\"","v":""},{"$f":"INDEX(信誉提升汇总记录表!D:D,SMALL(IF(信誉提升汇总记录表!$A:$A=$C$2,ROW($B:$B),36500),ROW(D155)))&\"\"","v":""},{"$f":"IF(ISERROR(VALUE(INDEX(信誉提升汇总记录表!E:E,SMALL(IF(信誉提升汇总记录表!$A:$A=$C$2,ROW($B:$B),36500),ROW(E155)))&\"\")),\"\",VALUE(INDEX(信誉提升汇总记录表!E:E,SMALL(IF(信誉提升汇总记录表!$A:$A=$C$2,ROW($B:$B),36500),ROW(E155)))&\"\"))","v":""},{"$f":"INDEX(信誉提升汇总记录表!J:J,SMALL(IF(信誉提升汇总记录表!$A:$A=$C$2,ROW($B:$B),36500),ROW(F155)))&\"\"","v":""},{"$f":"INDEX(信誉提升汇总记录表!K:K,SMALL(IF(信誉提升汇总记录表!$A:$A=$C$2,ROW($B:$B),36500),ROW(G155)))&\"\"","v":""},{"$f":"INDEX(信誉提升汇总记录表!M:M,SMALL(IF(信誉提升汇总记录表!$A:$A=$C$2,ROW($B:$B),36500),ROW(H155)))&\"\"","v":""}]
[{"$f":"IF(B159=\"\",\"\",INDEX(信誉提升汇总记录表!B:B,SMALL(IF(信誉提升汇总记录表!$A:$A=$C$2,ROW($B:$B),36500),ROW(A156))))","v":""},{"$f":"INDEX(信誉提升汇总记录表!A:A,SMALL(IF(信誉提升汇总记录表!$A:$A=$C$2,ROW($B:$B),36500),ROW(B156)))&\"\"","v":""},{"$f":"INDEX(信誉提升汇总记录表!C:C,SMALL(IF(信誉提升汇总记录表!$A:$A=$C$2,ROW($B:$B),36500),ROW(C156)))&\"\"","v":""},{"$f":"INDEX(信誉提升汇总记录表!D:D,SMALL(IF(信誉提升汇总记录表!$A:$A=$C$2,ROW($B:$B),36500),ROW(D156)))&\"\"","v":""},{"$f":"IF(ISERROR(VALUE(INDEX(信誉提升汇总记录表!E:E,SMALL(IF(信誉提升汇总记录表!$A:$A=$C$2,ROW($B:$B),36500),ROW(E156)))&\"\")),\"\",VALUE(INDEX(信誉提升汇总记录表!E:E,SMALL(IF(信誉提升汇总记录表!$A:$A=$C$2,ROW($B:$B),36500),ROW(E156)))&\"\"))","v":""},{"$f":"INDEX(信誉提升汇总记录表!J:J,SMALL(IF(信誉提升汇总记录表!$A:$A=$C$2,ROW($B:$B),36500),ROW(F156)))&\"\"","v":""},{"$f":"INDEX(信誉提升汇总记录表!K:K,SMALL(IF(信誉提升汇总记录表!$A:$A=$C$2,ROW($B:$B),36500),ROW(G156)))&\"\"","v":""},{"$f":"INDEX(信誉提升汇总记录表!M:M,SMALL(IF(信誉提升汇总记录表!$A:$A=$C$2,ROW($B:$B),36500),ROW(H156)))&\"\"","v":""}]
[{"$f":"IF(B160=\"\",\"\",INDEX(信誉提升汇总记录表!B:B,SMALL(IF(信誉提升汇总记录表!$A:$A=$C$2,ROW($B:$B),36500),ROW(A157))))","v":""},{"$f":"INDEX(信誉提升汇总记录表!A:A,SMALL(IF(信誉提升汇总记录表!$A:$A=$C$2,ROW($B:$B),36500),ROW(B157)))&\"\"","v":""},{"$f":"INDEX(信誉提升汇总记录表!C:C,SMALL(IF(信誉提升汇总记录表!$A:$A=$C$2,ROW($B:$B),36500),ROW(C157)))&\"\"","v":""},{"$f":"INDEX(信誉提升汇总记录表!D:D,SMALL(IF(信誉提升汇总记录表!$A:$A=$C$2,ROW($B:$B),36500),ROW(D157)))&\"\"","v":""},{"$f":"IF(ISERROR(VALUE(INDEX(信誉提升汇总记录表!E:E,SMALL(IF(信誉提升汇总记录表!$A:$A=$C$2,ROW($B:$B),36500),ROW(E157)))&\"\")),\"\",VALUE(INDEX(信誉提升汇总记录表!E:E,SMALL(IF(信誉提升汇总记录表!$A:$A=$C$2,ROW($B:$B),36500),ROW(E157)))&\"\"))","v":""},{"$f":"INDEX(信誉提升汇总记录表!J:J,SMALL(IF(信誉提升汇总记录表!$A:$A=$C$2,ROW($B:$B),36500),ROW(F157)))&\"\"","v":""},{"$f":"INDEX(信誉提升汇总记录表!K:K,SMALL(IF(信誉提升汇总记录表!$A:$A=$C$2,ROW($B:$B),36500),ROW(G157)))&\"\"","v":""},{"$f":"INDEX(信誉提升汇总记录表!M:M,SMALL(IF(信誉提升汇总记录表!$A:$A=$C$2,ROW($B:$B),36500),ROW(H157)))&\"\"","v":""}]
[{"$f":"IF(B161=\"\",\"\",INDEX(信誉提升汇总记录表!B:B,SMALL(IF(信誉提升汇总记录表!$A:$A=$C$2,ROW($B:$B),36500),ROW(A158))))","v":""},{"$f":"INDEX(信誉提升汇总记录表!A:A,SMALL(IF(信誉提升汇总记录表!$A:$A=$C$2,ROW($B:$B),36500),ROW(B158)))&\"\"","v":""},{"$f":"INDEX(信誉提升汇总记录表!C:C,SMALL(IF(信誉提升汇总记录表!$A:$A=$C$2,ROW($B:$B),36500),ROW(C158)))&\"\"","v":""},{"$f":"INDEX(信誉提升汇总记录表!D:D,SMALL(IF(信誉提升汇总记录表!$A:$A=$C$2,ROW($B:$B),36500),ROW(D158)))&\"\"","v":""},{"$f":"IF(ISERROR(VALUE(INDEX(信誉提升汇总记录表!E:E,SMALL(IF(信誉提升汇总记录表!$A:$A=$C$2,ROW($B:$B),36500),ROW(E158)))&\"\")),\"\",VALUE(INDEX(信誉提升汇总记录表!E:E,SMALL(IF(信誉提升汇总记录表!$A:$A=$C$2,ROW($B:$B),36500),ROW(E158)))&\"\"))","v":""},{"$f":"INDEX(信誉提升汇总记录表!J:J,SMALL(IF(信誉提升汇总记录表!$A:$A=$C$2,ROW($B:$B),36500),ROW(F158)))&\"\"","v":""},{"$f":"INDEX(信誉提升汇总记录表!K:K,SMALL(IF(信誉提升汇总记录表!$A:$A=$C$2,ROW($B:$B),36500),ROW(G158)))&\"\"","v":""},{"$f":"INDEX(信誉提升汇总记录表!M:M,SMALL(IF(信誉提升汇总记录表!$A:$A=$C$2,ROW($B:$B),36500),ROW(H158)))&\"\"","v":""}]
[{"$f":"IF(B162=\"\",\"\",INDEX(信誉提升汇总记录表!B:B,SMALL(IF(信誉提升汇总记录表!$A:$A=$C$2,ROW($B:$B),36500),ROW(A159))))","v":""},{"$f":"INDEX(信誉提升汇总记录表!A:A,SMALL(IF(信誉提升汇总记录表!$A:$A=$C$2,ROW($B:$B),36500),ROW(B159)))&\"\"","v":""},{"$f":"INDEX(信誉提升汇总记录表!C:C,SMALL(IF(信誉提升汇总记录表!$A:$A=$C$2,ROW($B:$B),36500),ROW(C159)))&\"\"","v":""},{"$f":"INDEX(信誉提升汇总记录表!D:D,SMALL(IF(信誉提升汇总记录表!$A:$A=$C$2,ROW($B:$B),36500),ROW(D159)))&\"\"","v":""},{"$f":"IF(ISERROR(VALUE(INDEX(信誉提升汇总记录表!E:E,SMALL(IF(信誉提升汇总记录表!$A:$A=$C$2,ROW($B:$B),36500),ROW(E159)))&\"\")),\"\",VALUE(INDEX(信誉提升汇总记录表!E:E,SMALL(IF(信誉提升汇总记录表!$A:$A=$C$2,ROW($B:$B),36500),ROW(E159)))&\"\"))","v":""},{"$f":"INDEX(信誉提升汇总记录表!J:J,SMALL(IF(信誉提升汇总记录表!$A:$A=$C$2,ROW($B:$B),36500),ROW(F159)))&\"\"","v":""},{"$f":"INDEX(信誉提升汇总记录表!K:K,SMALL(IF(信誉提升汇总记录表!$A:$A=$C$2,ROW($B:$B),36500),ROW(G159)))&\"\"","v":""},{"$f":"INDEX(信誉提升汇总记录表!M:M,SMALL(IF(信誉提升汇总记录表!$A:$A=$C$2,ROW($B:$B),36500),ROW(H159)))&\"\"","v":""}]
[{"$f":"IF(B163=\"\",\"\",INDEX(信誉提升汇总记录表!B:B,SMALL(IF(信誉提升汇总记录表!$A:$A=$C$2,ROW($B:$B),36500),ROW(A160))))","v":""},{"$f":"INDEX(信誉提升汇总记录表!A:A,SMALL(IF(信誉提升汇总记录表!$A:$A=$C$2,ROW($B:$B),36500),ROW(B160)))&\"\"","v":""},{"$f":"INDEX(信誉提升汇总记录表!C:C,SMALL(IF(信誉提升汇总记录表!$A:$A=$C$2,ROW($B:$B),36500),ROW(C160)))&\"\"","v":""},{"$f":"INDEX(信誉提升汇总记录表!D:D,SMALL(IF(信誉提升汇总记录表!$A:$A=$C$2,ROW($B:$B),36500),ROW(D160)))&\"\"","v":""},{"$f":"IF(ISERROR(VALUE(INDEX(信誉提升汇总记录表!E:E,SMALL(IF(信誉提升汇总记录表!$A:$A=$C$2,ROW($B:$B),36500),ROW(E160)))&\"\")),\"\",VALUE(INDEX(信誉提升汇总记录表!E:E,SMALL(IF(信誉提升汇总记录表!$A:$A=$C$2,ROW($B:$B),36500),ROW(E160)))&\"\"))","v":""},{"$f":"INDEX(信誉提升汇总记录表!J:J,SMALL(IF(信誉提升汇总记录表!$A:$A=$C$2,ROW($B:$B),36500),ROW(F160)))&\"\"","v":""},{"$f":"INDEX(信誉提升汇总记录表!K:K,SMALL(IF(信誉提升汇总记录表!$A:$A=$C$2,ROW($B:$B),36500),ROW(G160)))&\"\"","v":""},{"$f":"INDEX(信誉提升汇总记录表!M:M,SMALL(IF(信誉提升汇总记录表!$A:$A=$C$2,ROW($B:$B),36500),ROW(H160)))&\"\"","v":""}]
[{"$f":"IF(B164=\"\",\"\",INDEX(信誉提升汇总记录表!B:B,SMALL(IF(信誉提升汇总记录表!$A:$A=$C$2,ROW($B:$B),36500),ROW(A161))))","v":""},{"$f":"INDEX(信誉提升汇总记录表!A:A,SMALL(IF(信誉提升汇总记录表!$A:$A=$C$2,ROW($B:$B),36500),ROW(B161)))&\"\"","v":""},{"$f":"INDEX(信誉提升汇总记录表!C:C,SMALL(IF(信誉提升汇总记录表!$A:$A=$C$2,ROW($B:$B),36500),ROW(C161)))&\"\"","v":""},{"$f":"INDEX(信誉提升汇总记录表!D:D,SMALL(IF(信誉提升汇总记录表!$A:$A=$C$2,ROW($B:$B),36500),ROW(D161)))&\"\"","v":""},{"$f":"IF(ISERROR(VALUE(INDEX(信誉提升汇总记录表!E:E,SMALL(IF(信誉提升汇总记录表!$A:$A=$C$2,ROW($B:$B),36500),ROW(E161)))&\"\")),\"\",VALUE(INDEX(信誉提升汇总记录表!E:E,SMALL(IF(信誉提升汇总记录表!$A:$A=$C$2,ROW($B:$B),36500),ROW(E161)))&\"\"))","v":""},{"$f":"INDEX(信誉提升汇总记录表!J:J,SMALL(IF(信誉提升汇总记录表!$A:$A=$C$2,ROW($B:$B),36500),ROW(F161)))&\"\"","v":""},{"$f":"INDEX(信誉提升汇总记录表!K:K,SMALL(IF(信誉提升汇总记录表!$A:$A=$C$2,ROW($B:$B),36500),ROW(G161)))&\"\"","v":""},{"$f":"INDEX(信誉提升汇总记录表!M:M,SMALL(IF(信誉提升汇总记录表!$A:$A=$C$2,ROW($B:$B),36500),ROW(H161)))&\"\"","v":""}]
[{"$f":"IF(B165=\"\",\"\",INDEX(信誉提升汇总记录表!B:B,SMALL(IF(信誉提升汇总记录表!$A:$A=$C$2,ROW($B:$B),36500),ROW(A162))))","v":""},{"$f":"INDEX(信誉提升汇总记录表!A:A,SMALL(IF(信誉提升汇总记录表!$A:$A=$C$2,ROW($B:$B),36500),ROW(B162)))&\"\"","v":""},{"$f":"INDEX(信誉提升汇总记录表!C:C,SMALL(IF(信誉提升汇总记录表!$A:$A=$C$2,ROW($B:$B),36500),ROW(C162)))&\"\"","v":""},{"$f":"INDEX(信誉提升汇总记录表!D:D,SMALL(IF(信誉提升汇总记录表!$A:$A=$C$2,ROW($B:$B),36500),ROW(D162)))&\"\"","v":""},{"$f":"IF(ISERROR(VALUE(INDEX(信誉提升汇总记录表!E:E,SMALL(IF(信誉提升汇总记录表!$A:$A=$C$2,ROW($B:$B),36500),ROW(E162)))&\"\")),\"\",VALUE(INDEX(信誉提升汇总记录表!E:E,SMALL(IF(信誉提升汇总记录表!$A:$A=$C$2,ROW($B:$B),36500),ROW(E162)))&\"\"))","v":""},{"$f":"INDEX(信誉提升汇总记录表!J:J,SMALL(IF(信誉提升汇总记录表!$A:$A=$C$2,ROW($B:$B),36500),ROW(F162)))&\"\"","v":""},{"$f":"INDEX(信誉提升汇总记录表!K:K,SMALL(IF(信誉提升汇总记录表!$A:$A=$C$2,ROW($B:$B),36500),ROW(G162)))&\"\"","v":""},{"$f":"INDEX(信誉提升汇总记录表!M:M,SMALL(IF(信誉提升汇总记录表!$A:$A=$C$2,ROW($B:$B),36500),ROW(H162)))&\"\"","v":""}]
[{"$f":"IF(B166=\"\",\"\",INDEX(信誉提升汇总记录表!B:B,SMALL(IF(信誉提升汇总记录表!$A:$A=$C$2,ROW($B:$B),36500),ROW(A163))))","v":""},{"$f":"INDEX(信誉提升汇总记录表!A:A,SMALL(IF(信誉提升汇总记录表!$A:$A=$C$2,ROW($B:$B),36500),ROW(B163)))&\"\"","v":""},{"$f":"INDEX(信誉提升汇总记录表!C:C,SMALL(IF(信誉提升汇总记录表!$A:$A=$C$2,ROW($B:$B),36500),ROW(C163)))&\"\"","v":""},{"$f":"INDEX(信誉提升汇总记录表!D:D,SMALL(IF(信誉提升汇总记录表!$A:$A=$C$2,ROW($B:$B),36500),ROW(D163)))&\"\"","v":""},{"$f":"IF(ISERROR(VALUE(INDEX(信誉提升汇总记录表!E:E,SMALL(IF(信誉提升汇总记录表!$A:$A=$C$2,ROW($B:$B),36500),ROW(E163)))&\"\")),\"\",VALUE(INDEX(信誉提升汇总记录表!E:E,SMALL(IF(信誉提升汇总记录表!$A:$A=$C$2,ROW($B:$B),36500),ROW(E163)))&\"\"))","v":""},{"$f":"INDEX(信誉提升汇总记录表!J:J,SMALL(IF(信誉提升汇总记录表!$A:$A=$C$2,ROW($B:$B),36500),ROW(F163)))&\"\"","v":""},{"$f":"INDEX(信誉提升汇总记录表!K:K,SMALL(IF(信誉提升汇总记录表!$A:$A=$C$2,ROW($B:$B),36500),ROW(G163)))&\"\"","v":""},{"$f":"INDEX(信誉提升汇总记录表!M:M,SMALL(IF(信誉提升汇总记录表!$A:$A=$C$2,ROW($B:$B),36500),ROW(H163)))&\"\"","v":""}]
[{"$f":"IF(B167=\"\",\"\",INDEX(信誉提升汇总记录表!B:B,SMALL(IF(信誉提升汇总记录表!$A:$A=$C$2,ROW($B:$B),36500),ROW(A164))))","v":""},{"$f":"INDEX(信誉提升汇总记录表!A:A,SMALL(IF(信誉提升汇总记录表!$A:$A=$C$2,ROW($B:$B),36500),ROW(B164)))&\"\"","v":""},{"$f":"INDEX(信誉提升汇总记录表!C:C,SMALL(IF(信誉提升汇总记录表!$A:$A=$C$2,ROW($B:$B),36500),ROW(C164)))&\"\"","v":""},{"$f":"INDEX(信誉提升汇总记录表!D:D,SMALL(IF(信誉提升汇总记录表!$A:$A=$C$2,ROW($B:$B),36500),ROW(D164)))&\"\"","v":""},{"$f":"IF(ISERROR(VALUE(INDEX(信誉提升汇总记录表!E:E,SMALL(IF(信誉提升汇总记录表!$A:$A=$C$2,ROW($B:$B),36500),ROW(E164)))&\"\")),\"\",VALUE(INDEX(信誉提升汇总记录表!E:E,SMALL(IF(信誉提升汇总记录表!$A:$A=$C$2,ROW($B:$B),36500),ROW(E164)))&\"\"))","v":""},{"$f":"INDEX(信誉提升汇总记录表!J:J,SMALL(IF(信誉提升汇总记录表!$A:$A=$C$2,ROW($B:$B),36500),ROW(F164)))&\"\"","v":""},{"$f":"INDEX(信誉提升汇总记录表!K:K,SMALL(IF(信誉提升汇总记录表!$A:$A=$C$2,ROW($B:$B),36500),ROW(G164)))&\"\"","v":""},{"$f":"INDEX(信誉提升汇总记录表!M:M,SMALL(IF(信誉提升汇总记录表!$A:$A=$C$2,ROW($B:$B),36500),ROW(H164)))&\"\"","v":""}]
[{"$f":"IF(B168=\"\",\"\",INDEX(信誉提升汇总记录表!B:B,SMALL(IF(信誉提升汇总记录表!$A:$A=$C$2,ROW($B:$B),36500),ROW(A165))))","v":""},{"$f":"INDEX(信誉提升汇总记录表!A:A,SMALL(IF(信誉提升汇总记录表!$A:$A=$C$2,ROW($B:$B),36500),ROW(B165)))&\"\"","v":""},{"$f":"INDEX(信誉提升汇总记录表!C:C,SMALL(IF(信誉提升汇总记录表!$A:$A=$C$2,ROW($B:$B),36500),ROW(C165)))&\"\"","v":""},{"$f":"INDEX(信誉提升汇总记录表!D:D,SMALL(IF(信誉提升汇总记录表!$A:$A=$C$2,ROW($B:$B),36500),ROW(D165)))&\"\"","v":""},{"$f":"IF(ISERROR(VALUE(INDEX(信誉提升汇总记录表!E:E,SMALL(IF(信誉提升汇总记录表!$A:$A=$C$2,ROW($B:$B),36500),ROW(E165)))&\"\")),\"\",VALUE(INDEX(信誉提升汇总记录表!E:E,SMALL(IF(信誉提升汇总记录表!$A:$A=$C$2,ROW($B:$B),36500),ROW(E165)))&\"\"))","v":""},{"$f":"INDEX(信誉提升汇总记录表!J:J,SMALL(IF(信誉提升汇总记录表!$A:$A=$C$2,ROW($B:$B),36500),ROW(F165)))&\"\"","v":""},{"$f":"INDEX(信誉提升汇总记录表!K:K,SMALL(IF(信誉提升汇总记录表!$A:$A=$C$2,ROW($B:$B),36500),ROW(G165)))&\"\"","v":""},{"$f":"INDEX(信誉提升汇总记录表!M:M,SMALL(IF(信誉提升汇总记录表!$A:$A=$C$2,ROW($B:$B),36500),ROW(H165)))&\"\"","v":""}]
[{"$f":"IF(B169=\"\",\"\",INDEX(信誉提升汇总记录表!B:B,SMALL(IF(信誉提升汇总记录表!$A:$A=$C$2,ROW($B:$B),36500),ROW(A166))))","v":""},{"$f":"INDEX(信誉提升汇总记录表!A:A,SMALL(IF(信誉提升汇总记录表!$A:$A=$C$2,ROW($B:$B),36500),ROW(B166)))&\"\"","v":""},{"$f":"INDEX(信誉提升汇总记录表!C:C,SMALL(IF(信誉提升汇总记录表!$A:$A=$C$2,ROW($B:$B),36500),ROW(C166)))&\"\"","v":""},{"$f":"INDEX(信誉提升汇总记录表!D:D,SMALL(IF(信誉提升汇总记录表!$A:$A=$C$2,ROW($B:$B),36500),ROW(D166)))&\"\"","v":""},{"$f":"IF(ISERROR(VALUE(INDEX(信誉提升汇总记录表!E:E,SMALL(IF(信誉提升汇总记录表!$A:$A=$C$2,ROW($B:$B),36500),ROW(E166)))&\"\")),\"\",VALUE(INDEX(信誉提升汇总记录表!E:E,SMALL(IF(信誉提升汇总记录表!$A:$A=$C$2,ROW($B:$B),36500),ROW(E166)))&\"\"))","v":""},{"$f":"INDEX(信誉提升汇总记录表!J:J,SMALL(IF(信誉提升汇总记录表!$A:$A=$C$2,ROW($B:$B),36500),ROW(F166)))&\"\"","v":""},{"$f":"INDEX(信誉提升汇总记录表!K:K,SMALL(IF(信誉提升汇总记录表!$A:$A=$C$2,ROW($B:$B),36500),ROW(G166)))&\"\"","v":""},{"$f":"INDEX(信誉提升汇总记录表!M:M,SMALL(IF(信誉提升汇总记录表!$A:$A=$C$2,ROW($B:$B),36500),ROW(H166)))&\"\"","v":""}]
[{"$f":"IF(B170=\"\",\"\",INDEX(信誉提升汇总记录表!B:B,SMALL(IF(信誉提升汇总记录表!$A:$A=$C$2,ROW($B:$B),36500),ROW(A167))))","v":""},{"$f":"INDEX(信誉提升汇总记录表!A:A,SMALL(IF(信誉提升汇总记录表!$A:$A=$C$2,ROW($B:$B),36500),ROW(B167)))&\"\"","v":""},{"$f":"INDEX(信誉提升汇总记录表!C:C,SMALL(IF(信誉提升汇总记录表!$A:$A=$C$2,ROW($B:$B),36500),ROW(C167)))&\"\"","v":""},{"$f":"INDEX(信誉提升汇总记录表!D:D,SMALL(IF(信誉提升汇总记录表!$A:$A=$C$2,ROW($B:$B),36500),ROW(D167)))&\"\"","v":""},{"$f":"IF(ISERROR(VALUE(INDEX(信誉提升汇总记录表!E:E,SMALL(IF(信誉提升汇总记录表!$A:$A=$C$2,ROW($B:$B),36500),ROW(E167)))&\"\")),\"\",VALUE(INDEX(信誉提升汇总记录表!E:E,SMALL(IF(信誉提升汇总记录表!$A:$A=$C$2,ROW($B:$B),36500),ROW(E167)))&\"\"))","v":""},{"$f":"INDEX(信誉提升汇总记录表!J:J,SMALL(IF(信誉提升汇总记录表!$A:$A=$C$2,ROW($B:$B),36500),ROW(F167)))&\"\"","v":""},{"$f":"INDEX(信誉提升汇总记录表!K:K,SMALL(IF(信誉提升汇总记录表!$A:$A=$C$2,ROW($B:$B),36500),ROW(G167)))&\"\"","v":""},{"$f":"INDEX(信誉提升汇总记录表!M:M,SMALL(IF(信誉提升汇总记录表!$A:$A=$C$2,ROW($B:$B),36500),ROW(H167)))&\"\"","v":""}]
[{"$f":"IF(B171=\"\",\"\",INDEX(信誉提升汇总记录表!B:B,SMALL(IF(信誉提升汇总记录表!$A:$A=$C$2,ROW($B:$B),36500),ROW(A168))))","v":""},{"$f":"INDEX(信誉提升汇总记录表!A:A,SMALL(IF(信誉提升汇总记录表!$A:$A=$C$2,ROW($B:$B),36500),ROW(B168)))&\"\"","v":""},{"$f":"INDEX(信誉提升汇总记录表!C:C,SMALL(IF(信誉提升汇总记录表!$A:$A=$C$2,ROW($B:$B),36500),ROW(C168)))&\"\"","v":""},{"$f":"INDEX(信誉提升汇总记录表!D:D,SMALL(IF(信誉提升汇总记录表!$A:$A=$C$2,ROW($B:$B),36500),ROW(D168)))&\"\"","v":""},{"$f":"IF(ISERROR(VALUE(INDEX(信誉提升汇总记录表!E:E,SMALL(IF(信誉提升汇总记录表!$A:$A=$C$2,ROW($B:$B),36500),ROW(E168)))&\"\")),\"\",VALUE(INDEX(信誉提升汇总记录表!E:E,SMALL(IF(信誉提升汇总记录表!$A:$A=$C$2,ROW($B:$B),36500),ROW(E168)))&\"\"))","v":""},{"$f":"INDEX(信誉提升汇总记录表!J:J,SMALL(IF(信誉提升汇总记录表!$A:$A=$C$2,ROW($B:$B),36500),ROW(F168)))&\"\"","v":""},{"$f":"INDEX(信誉提升汇总记录表!K:K,SMALL(IF(信誉提升汇总记录表!$A:$A=$C$2,ROW($B:$B),36500),ROW(G168)))&\"\"","v":""},{"$f":"INDEX(信誉提升汇总记录表!M:M,SMALL(IF(信誉提升汇总记录表!$A:$A=$C$2,ROW($B:$B),36500),ROW(H168)))&\"\"","v":""}]
[{"$f":"IF(B172=\"\",\"\",INDEX(信誉提升汇总记录表!B:B,SMALL(IF(信誉提升汇总记录表!$A:$A=$C$2,ROW($B:$B),36500),ROW(A169))))","v":""},{"$f":"INDEX(信誉提升汇总记录表!A:A,SMALL(IF(信誉提升汇总记录表!$A:$A=$C$2,ROW($B:$B),36500),ROW(B169)))&\"\"","v":""},{"$f":"INDEX(信誉提升汇总记录表!C:C,SMALL(IF(信誉提升汇总记录表!$A:$A=$C$2,ROW($B:$B),36500),ROW(C169)))&\"\"","v":""},{"$f":"INDEX(信誉提升汇总记录表!D:D,SMALL(IF(信誉提升汇总记录表!$A:$A=$C$2,ROW($B:$B),36500),ROW(D169)))&\"\"","v":""},{"$f":"IF(ISERROR(VALUE(INDEX(信誉提升汇总记录表!E:E,SMALL(IF(信誉提升汇总记录表!$A:$A=$C$2,ROW($B:$B),36500),ROW(E169)))&\"\")),\"\",VALUE(INDEX(信誉提升汇总记录表!E:E,SMALL(IF(信誉提升汇总记录表!$A:$A=$C$2,ROW($B:$B),36500),ROW(E169)))&\"\"))","v":""},{"$f":"INDEX(信誉提升汇总记录表!J:J,SMALL(IF(信誉提升汇总记录表!$A:$A=$C$2,ROW($B:$B),36500),ROW(F169)))&\"\"","v":""},{"$f":"INDEX(信誉提升汇总记录表!K:K,SMALL(IF(信誉提升汇总记录表!$A:$A=$C$2,ROW($B:$B),36500),ROW(G169)))&\"\"","v":""},{"$f":"INDEX(信誉提升汇总记录表!M:M,SMALL(IF(信誉提升汇总记录表!$A:$A=$C$2,ROW($B:$B),36500),ROW(H169)))&\"\"","v":""}]
[{"$f":"IF(B173=\"\",\"\",INDEX(信誉提升汇总记录表!B:B,SMALL(IF(信誉提升汇总记录表!$A:$A=$C$2,ROW($B:$B),36500),ROW(A170))))","v":""},{"$f":"INDEX(信誉提升汇总记录表!A:A,SMALL(IF(信誉提升汇总记录表!$A:$A=$C$2,ROW($B:$B),36500),ROW(B170)))&\"\"","v":""},{"$f":"INDEX(信誉提升汇总记录表!C:C,SMALL(IF(信誉提升汇总记录表!$A:$A=$C$2,ROW($B:$B),36500),ROW(C170)))&\"\"","v":""},{"$f":"INDEX(信誉提升汇总记录表!D:D,SMALL(IF(信誉提升汇总记录表!$A:$A=$C$2,ROW($B:$B),36500),ROW(D170)))&\"\"","v":""},{"$f":"IF(ISERROR(VALUE(INDEX(信誉提升汇总记录表!E:E,SMALL(IF(信誉提升汇总记录表!$A:$A=$C$2,ROW($B:$B),36500),ROW(E170)))&\"\")),\"\",VALUE(INDEX(信誉提升汇总记录表!E:E,SMALL(IF(信誉提升汇总记录表!$A:$A=$C$2,ROW($B:$B),36500),ROW(E170)))&\"\"))","v":""},{"$f":"INDEX(信誉提升汇总记录表!J:J,SMALL(IF(信誉提升汇总记录表!$A:$A=$C$2,ROW($B:$B),36500),ROW(F170)))&\"\"","v":""},{"$f":"INDEX(信誉提升汇总记录表!K:K,SMALL(IF(信誉提升汇总记录表!$A:$A=$C$2,ROW($B:$B),36500),ROW(G170)))&\"\"","v":""},{"$f":"INDEX(信誉提升汇总记录表!M:M,SMALL(IF(信誉提升汇总记录表!$A:$A=$C$2,ROW($B:$B),36500),ROW(H170)))&\"\"","v":""}]
[{"$f":"IF(B174=\"\",\"\",INDEX(信誉提升汇总记录表!B:B,SMALL(IF(信誉提升汇总记录表!$A:$A=$C$2,ROW($B:$B),36500),ROW(A171))))","v":""},{"$f":"INDEX(信誉提升汇总记录表!A:A,SMALL(IF(信誉提升汇总记录表!$A:$A=$C$2,ROW($B:$B),36500),ROW(B171)))&\"\"","v":""},{"$f":"INDEX(信誉提升汇总记录表!C:C,SMALL(IF(信誉提升汇总记录表!$A:$A=$C$2,ROW($B:$B),36500),ROW(C171)))&\"\"","v":""},{"$f":"INDEX(信誉提升汇总记录表!D:D,SMALL(IF(信誉提升汇总记录表!$A:$A=$C$2,ROW($B:$B),36500),ROW(D171)))&\"\"","v":""},{"$f":"IF(ISERROR(VALUE(INDEX(信誉提升汇总记录表!E:E,SMALL(IF(信誉提升汇总记录表!$A:$A=$C$2,ROW($B:$B),36500),ROW(E171)))&\"\")),\"\",VALUE(INDEX(信誉提升汇总记录表!E:E,SMALL(IF(信誉提升汇总记录表!$A:$A=$C$2,ROW($B:$B),36500),ROW(E171)))&\"\"))","v":""},{"$f":"INDEX(信誉提升汇总记录表!J:J,SMALL(IF(信誉提升汇总记录表!$A:$A=$C$2,ROW($B:$B),36500),ROW(F171)))&\"\"","v":""},{"$f":"INDEX(信誉提升汇总记录表!K:K,SMALL(IF(信誉提升汇总记录表!$A:$A=$C$2,ROW($B:$B),36500),ROW(G171)))&\"\"","v":""},{"$f":"INDEX(信誉提升汇总记录表!M:M,SMALL(IF(信誉提升汇总记录表!$A:$A=$C$2,ROW($B:$B),36500),ROW(H171)))&\"\"","v":""}]
[{"$f":"IF(B175=\"\",\"\",INDEX(信誉提升汇总记录表!B:B,SMALL(IF(信誉提升汇总记录表!$A:$A=$C$2,ROW($B:$B),36500),ROW(A172))))","v":""},{"$f":"INDEX(信誉提升汇总记录表!A:A,SMALL(IF(信誉提升汇总记录表!$A:$A=$C$2,ROW($B:$B),36500),ROW(B172)))&\"\"","v":""},{"$f":"INDEX(信誉提升汇总记录表!C:C,SMALL(IF(信誉提升汇总记录表!$A:$A=$C$2,ROW($B:$B),36500),ROW(C172)))&\"\"","v":""},{"$f":"INDEX(信誉提升汇总记录表!D:D,SMALL(IF(信誉提升汇总记录表!$A:$A=$C$2,ROW($B:$B),36500),ROW(D172)))&\"\"","v":""},{"$f":"IF(ISERROR(VALUE(INDEX(信誉提升汇总记录表!E:E,SMALL(IF(信誉提升汇总记录表!$A:$A=$C$2,ROW($B:$B),36500),ROW(E172)))&\"\")),\"\",VALUE(INDEX(信誉提升汇总记录表!E:E,SMALL(IF(信誉提升汇总记录表!$A:$A=$C$2,ROW($B:$B),36500),ROW(E172)))&\"\"))","v":""},{"$f":"INDEX(信誉提升汇总记录表!J:J,SMALL(IF(信誉提升汇总记录表!$A:$A=$C$2,ROW($B:$B),36500),ROW(F172)))&\"\"","v":""},{"$f":"INDEX(信誉提升汇总记录表!K:K,SMALL(IF(信誉提升汇总记录表!$A:$A=$C$2,ROW($B:$B),36500),ROW(G172)))&\"\"","v":""},{"$f":"INDEX(信誉提升汇总记录表!M:M,SMALL(IF(信誉提升汇总记录表!$A:$A=$C$2,ROW($B:$B),36500),ROW(H172)))&\"\"","v":""}]
[{"$f":"IF(B176=\"\",\"\",INDEX(信誉提升汇总记录表!B:B,SMALL(IF(信誉提升汇总记录表!$A:$A=$C$2,ROW($B:$B),36500),ROW(A173))))","v":""},{"$f":"INDEX(信誉提升汇总记录表!A:A,SMALL(IF(信誉提升汇总记录表!$A:$A=$C$2,ROW($B:$B),36500),ROW(B173)))&\"\"","v":""},{"$f":"INDEX(信誉提升汇总记录表!C:C,SMALL(IF(信誉提升汇总记录表!$A:$A=$C$2,ROW($B:$B),36500),ROW(C173)))&\"\"","v":""},{"$f":"INDEX(信誉提升汇总记录表!D:D,SMALL(IF(信誉提升汇总记录表!$A:$A=$C$2,ROW($B:$B),36500),ROW(D173)))&\"\"","v":""},{"$f":"IF(ISERROR(VALUE(INDEX(信誉提升汇总记录表!E:E,SMALL(IF(信誉提升汇总记录表!$A:$A=$C$2,ROW($B:$B),36500),ROW(E173)))&\"\")),\"\",VALUE(INDEX(信誉提升汇总记录表!E:E,SMALL(IF(信誉提升汇总记录表!$A:$A=$C$2,ROW($B:$B),36500),ROW(E173)))&\"\"))","v":""},{"$f":"INDEX(信誉提升汇总记录表!J:J,SMALL(IF(信誉提升汇总记录表!$A:$A=$C$2,ROW($B:$B),36500),ROW(F173)))&\"\"","v":""},{"$f":"INDEX(信誉提升汇总记录表!K:K,SMALL(IF(信誉提升汇总记录表!$A:$A=$C$2,ROW($B:$B),36500),ROW(G173)))&\"\"","v":""},{"$f":"INDEX(信誉提升汇总记录表!M:M,SMALL(IF(信誉提升汇总记录表!$A:$A=$C$2,ROW($B:$B),36500),ROW(H173)))&\"\"","v":""}]
[{"$f":"IF(B177=\"\",\"\",INDEX(信誉提升汇总记录表!B:B,SMALL(IF(信誉提升汇总记录表!$A:$A=$C$2,ROW($B:$B),36500),ROW(A174))))","v":""},{"$f":"INDEX(信誉提升汇总记录表!A:A,SMALL(IF(信誉提升汇总记录表!$A:$A=$C$2,ROW($B:$B),36500),ROW(B174)))&\"\"","v":""},{"$f":"INDEX(信誉提升汇总记录表!C:C,SMALL(IF(信誉提升汇总记录表!$A:$A=$C$2,ROW($B:$B),36500),ROW(C174)))&\"\"","v":""},{"$f":"INDEX(信誉提升汇总记录表!D:D,SMALL(IF(信誉提升汇总记录表!$A:$A=$C$2,ROW($B:$B),36500),ROW(D174)))&\"\"","v":""},{"$f":"IF(ISERROR(VALUE(INDEX(信誉提升汇总记录表!E:E,SMALL(IF(信誉提升汇总记录表!$A:$A=$C$2,ROW($B:$B),36500),ROW(E174)))&\"\")),\"\",VALUE(INDEX(信誉提升汇总记录表!E:E,SMALL(IF(信誉提升汇总记录表!$A:$A=$C$2,ROW($B:$B),36500),ROW(E174)))&\"\"))","v":""},{"$f":"INDEX(信誉提升汇总记录表!J:J,SMALL(IF(信誉提升汇总记录表!$A:$A=$C$2,ROW($B:$B),36500),ROW(F174)))&\"\"","v":""},{"$f":"INDEX(信誉提升汇总记录表!K:K,SMALL(IF(信誉提升汇总记录表!$A:$A=$C$2,ROW($B:$B),36500),ROW(G174)))&\"\"","v":""},{"$f":"INDEX(信誉提升汇总记录表!M:M,SMALL(IF(信誉提升汇总记录表!$A:$A=$C$2,ROW($B:$B),36500),ROW(H174)))&\"\"","v":""}]
[{"$f":"IF(B178=\"\",\"\",INDEX(信誉提升汇总记录表!B:B,SMALL(IF(信誉提升汇总记录表!$A:$A=$C$2,ROW($B:$B),36500),ROW(A175))))","v":""},{"$f":"INDEX(信誉提升汇总记录表!A:A,SMALL(IF(信誉提升汇总记录表!$A:$A=$C$2,ROW($B:$B),36500),ROW(B175)))&\"\"","v":""},{"$f":"INDEX(信誉提升汇总记录表!C:C,SMALL(IF(信誉提升汇总记录表!$A:$A=$C$2,ROW($B:$B),36500),ROW(C175)))&\"\"","v":""},{"$f":"INDEX(信誉提升汇总记录表!D:D,SMALL(IF(信誉提升汇总记录表!$A:$A=$C$2,ROW($B:$B),36500),ROW(D175)))&\"\"","v":""},{"$f":"IF(ISERROR(VALUE(INDEX(信誉提升汇总记录表!E:E,SMALL(IF(信誉提升汇总记录表!$A:$A=$C$2,ROW($B:$B),36500),ROW(E175)))&\"\")),\"\",VALUE(INDEX(信誉提升汇总记录表!E:E,SMALL(IF(信誉提升汇总记录表!$A:$A=$C$2,ROW($B:$B),36500),ROW(E175)))&\"\"))","v":""},{"$f":"INDEX(信誉提升汇总记录表!J:J,SMALL(IF(信誉提升汇总记录表!$A:$A=$C$2,ROW($B:$B),36500),ROW(F175)))&\"\"","v":""},{"$f":"INDEX(信誉提升汇总记录表!K:K,SMALL(IF(信誉提升汇总记录表!$A:$A=$C$2,ROW($B:$B),36500),ROW(G175)))&\"\"","v":""},{"$f":"INDEX(信誉提升汇总记录表!M:M,SMALL(IF(信誉提升汇总记录表!$A:$A=$C$2,ROW($B:$B),36500),ROW(H175)))&\"\"","v":""}]
[{"$f":"IF(B179=\"\",\"\",INDEX(信誉提升汇总记录表!B:B,SMALL(IF(信誉提升汇总记录表!$A:$A=$C$2,ROW($B:$B),36500),ROW(A176))))","v":""},{"$f":"INDEX(信誉提升汇总记录表!A:A,SMALL(IF(信誉提升汇总记录表!$A:$A=$C$2,ROW($B:$B),36500),ROW(B176)))&\"\"","v":""},{"$f":"INDEX(信誉提升汇总记录表!C:C,SMALL(IF(信誉提升汇总记录表!$A:$A=$C$2,ROW($B:$B),36500),ROW(C176)))&\"\"","v":""},{"$f":"INDEX(信誉提升汇总记录表!D:D,SMALL(IF(信誉提升汇总记录表!$A:$A=$C$2,ROW($B:$B),36500),ROW(D176)))&\"\"","v":""},{"$f":"IF(ISERROR(VALUE(INDEX(信誉提升汇总记录表!E:E,SMALL(IF(信誉提升汇总记录表!$A:$A=$C$2,ROW($B:$B),36500),ROW(E176)))&\"\")),\"\",VALUE(INDEX(信誉提升汇总记录表!E:E,SMALL(IF(信誉提升汇总记录表!$A:$A=$C$2,ROW($B:$B),36500),ROW(E176)))&\"\"))","v":""},{"$f":"INDEX(信誉提升汇总记录表!J:J,SMALL(IF(信誉提升汇总记录表!$A:$A=$C$2,ROW($B:$B),36500),ROW(F176)))&\"\"","v":""},{"$f":"INDEX(信誉提升汇总记录表!K:K,SMALL(IF(信誉提升汇总记录表!$A:$A=$C$2,ROW($B:$B),36500),ROW(G176)))&\"\"","v":""},{"$f":"INDEX(信誉提升汇总记录表!M:M,SMALL(IF(信誉提升汇总记录表!$A:$A=$C$2,ROW($B:$B),36500),ROW(H176)))&\"\"","v":""}]
[{"$f":"IF(B180=\"\",\"\",INDEX(信誉提升汇总记录表!B:B,SMALL(IF(信誉提升汇总记录表!$A:$A=$C$2,ROW($B:$B),36500),ROW(A177))))","v":""},{"$f":"INDEX(信誉提升汇总记录表!A:A,SMALL(IF(信誉提升汇总记录表!$A:$A=$C$2,ROW($B:$B),36500),ROW(B177)))&\"\"","v":""},{"$f":"INDEX(信誉提升汇总记录表!C:C,SMALL(IF(信誉提升汇总记录表!$A:$A=$C$2,ROW($B:$B),36500),ROW(C177)))&\"\"","v":""},{"$f":"INDEX(信誉提升汇总记录表!D:D,SMALL(IF(信誉提升汇总记录表!$A:$A=$C$2,ROW($B:$B),36500),ROW(D177)))&\"\"","v":""},{"$f":"IF(ISERROR(VALUE(INDEX(信誉提升汇总记录表!E:E,SMALL(IF(信誉提升汇总记录表!$A:$A=$C$2,ROW($B:$B),36500),ROW(E177)))&\"\")),\"\",VALUE(INDEX(信誉提升汇总记录表!E:E,SMALL(IF(信誉提升汇总记录表!$A:$A=$C$2,ROW($B:$B),36500),ROW(E177)))&\"\"))","v":""},{"$f":"INDEX(信誉提升汇总记录表!J:J,SMALL(IF(信誉提升汇总记录表!$A:$A=$C$2,ROW($B:$B),36500),ROW(F177)))&\"\"","v":""},{"$f":"INDEX(信誉提升汇总记录表!K:K,SMALL(IF(信誉提升汇总记录表!$A:$A=$C$2,ROW($B:$B),36500),ROW(G177)))&\"\"","v":""},{"$f":"INDEX(信誉提升汇总记录表!M:M,SMALL(IF(信誉提升汇总记录表!$A:$A=$C$2,ROW($B:$B),36500),ROW(H177)))&\"\"","v":""}]
[{"$f":"IF(B181=\"\",\"\",INDEX(信誉提升汇总记录表!B:B,SMALL(IF(信誉提升汇总记录表!$A:$A=$C$2,ROW($B:$B),36500),ROW(A178))))","v":""},{"$f":"INDEX(信誉提升汇总记录表!A:A,SMALL(IF(信誉提升汇总记录表!$A:$A=$C$2,ROW($B:$B),36500),ROW(B178)))&\"\"","v":""},{"$f":"INDEX(信誉提升汇总记录表!C:C,SMALL(IF(信誉提升汇总记录表!$A:$A=$C$2,ROW($B:$B),36500),ROW(C178)))&\"\"","v":""},{"$f":"INDEX(信誉提升汇总记录表!D:D,SMALL(IF(信誉提升汇总记录表!$A:$A=$C$2,ROW($B:$B),36500),ROW(D178)))&\"\"","v":""},{"$f":"IF(ISERROR(VALUE(INDEX(信誉提升汇总记录表!E:E,SMALL(IF(信誉提升汇总记录表!$A:$A=$C$2,ROW($B:$B),36500),ROW(E178)))&\"\")),\"\",VALUE(INDEX(信誉提升汇总记录表!E:E,SMALL(IF(信誉提升汇总记录表!$A:$A=$C$2,ROW($B:$B),36500),ROW(E178)))&\"\"))","v":""},{"$f":"INDEX(信誉提升汇总记录表!J:J,SMALL(IF(信誉提升汇总记录表!$A:$A=$C$2,ROW($B:$B),36500),ROW(F178)))&\"\"","v":""},{"$f":"INDEX(信誉提升汇总记录表!K:K,SMALL(IF(信誉提升汇总记录表!$A:$A=$C$2,ROW($B:$B),36500),ROW(G178)))&\"\"","v":""},{"$f":"INDEX(信誉提升汇总记录表!M:M,SMALL(IF(信誉提升汇总记录表!$A:$A=$C$2,ROW($B:$B),36500),ROW(H178)))&\"\"","v":""}]
[{"$f":"IF(B182=\"\",\"\",INDEX(信誉提升汇总记录表!B:B,SMALL(IF(信誉提升汇总记录表!$A:$A=$C$2,ROW($B:$B),36500),ROW(A179))))","v":""},{"$f":"INDEX(信誉提升汇总记录表!A:A,SMALL(IF(信誉提升汇总记录表!$A:$A=$C$2,ROW($B:$B),36500),ROW(B179)))&\"\"","v":""},{"$f":"INDEX(信誉提升汇总记录表!C:C,SMALL(IF(信誉提升汇总记录表!$A:$A=$C$2,ROW($B:$B),36500),ROW(C179)))&\"\"","v":""},{"$f":"INDEX(信誉提升汇总记录表!D:D,SMALL(IF(信誉提升汇总记录表!$A:$A=$C$2,ROW($B:$B),36500),ROW(D179)))&\"\"","v":""},{"$f":"IF(ISERROR(VALUE(INDEX(信誉提升汇总记录表!E:E,SMALL(IF(信誉提升汇总记录表!$A:$A=$C$2,ROW($B:$B),36500),ROW(E179)))&\"\")),\"\",VALUE(INDEX(信誉提升汇总记录表!E:E,SMALL(IF(信誉提升汇总记录表!$A:$A=$C$2,ROW($B:$B),36500),ROW(E179)))&\"\"))","v":""},{"$f":"INDEX(信誉提升汇总记录表!J:J,SMALL(IF(信誉提升汇总记录表!$A:$A=$C$2,ROW($B:$B),36500),ROW(F179)))&\"\"","v":""},{"$f":"INDEX(信誉提升汇总记录表!K:K,SMALL(IF(信誉提升汇总记录表!$A:$A=$C$2,ROW($B:$B),36500),ROW(G179)))&\"\"","v":""},{"$f":"INDEX(信誉提升汇总记录表!M:M,SMALL(IF(信誉提升汇总记录表!$A:$A=$C$2,ROW($B:$B),36500),ROW(H179)))&\"\"","v":""}]
[{"$f":"IF(B183=\"\",\"\",INDEX(信誉提升汇总记录表!B:B,SMALL(IF(信誉提升汇总记录表!$A:$A=$C$2,ROW($B:$B),36500),ROW(A180))))","v":""},{"$f":"INDEX(信誉提升汇总记录表!A:A,SMALL(IF(信誉提升汇总记录表!$A:$A=$C$2,ROW($B:$B),36500),ROW(B180)))&\"\"","v":""},{"$f":"INDEX(信誉提升汇总记录表!C:C,SMALL(IF(信誉提升汇总记录表!$A:$A=$C$2,ROW($B:$B),36500),ROW(C180)))&\"\"","v":""},{"$f":"INDEX(信誉提升汇总记录表!D:D,SMALL(IF(信誉提升汇总记录表!$A:$A=$C$2,ROW($B:$B),36500),ROW(D180)))&\"\"","v":""},{"$f":"IF(ISERROR(VALUE(INDEX(信誉提升汇总记录表!E:E,SMALL(IF(信誉提升汇总记录表!$A:$A=$C$2,ROW($B:$B),36500),ROW(E180)))&\"\")),\"\",VALUE(INDEX(信誉提升汇总记录表!E:E,SMALL(IF(信誉提升汇总记录表!$A:$A=$C$2,ROW($B:$B),36500),ROW(E180)))&\"\"))","v":""},{"$f":"INDEX(信誉提升汇总记录表!J:J,SMALL(IF(信誉提升汇总记录表!$A:$A=$C$2,ROW($B:$B),36500),ROW(F180)))&\"\"","v":""},{"$f":"INDEX(信誉提升汇总记录表!K:K,SMALL(IF(信誉提升汇总记录表!$A:$A=$C$2,ROW($B:$B),36500),ROW(G180)))&\"\"","v":""},{"$f":"INDEX(信誉提升汇总记录表!M:M,SMALL(IF(信誉提升汇总记录表!$A:$A=$C$2,ROW($B:$B),36500),ROW(H180)))&\"\"","v":""}]
[{"$f":"IF(B184=\"\",\"\",INDEX(信誉提升汇总记录表!B:B,SMALL(IF(信誉提升汇总记录表!$A:$A=$C$2,ROW($B:$B),36500),ROW(A181))))","v":""},{"$f":"INDEX(信誉提升汇总记录表!A:A,SMALL(IF(信誉提升汇总记录表!$A:$A=$C$2,ROW($B:$B),36500),ROW(B181)))&\"\"","v":""},{"$f":"INDEX(信誉提升汇总记录表!C:C,SMALL(IF(信誉提升汇总记录表!$A:$A=$C$2,ROW($B:$B),36500),ROW(C181)))&\"\"","v":""},{"$f":"INDEX(信誉提升汇总记录表!D:D,SMALL(IF(信誉提升汇总记录表!$A:$A=$C$2,ROW($B:$B),36500),ROW(D181)))&\"\"","v":""},{"$f":"IF(ISERROR(VALUE(INDEX(信誉提升汇总记录表!E:E,SMALL(IF(信誉提升汇总记录表!$A:$A=$C$2,ROW($B:$B),36500),ROW(E181)))&\"\")),\"\",VALUE(INDEX(信誉提升汇总记录表!E:E,SMALL(IF(信誉提升汇总记录表!$A:$A=$C$2,ROW($B:$B),36500),ROW(E181)))&\"\"))","v":""},{"$f":"INDEX(信誉提升汇总记录表!J:J,SMALL(IF(信誉提升汇总记录表!$A:$A=$C$2,ROW($B:$B),36500),ROW(F181)))&\"\"","v":""},{"$f":"INDEX(信誉提升汇总记录表!K:K,SMALL(IF(信誉提升汇总记录表!$A:$A=$C$2,ROW($B:$B),36500),ROW(G181)))&\"\"","v":""},{"$f":"INDEX(信誉提升汇总记录表!M:M,SMALL(IF(信誉提升汇总记录表!$A:$A=$C$2,ROW($B:$B),36500),ROW(H181)))&\"\"","v":""}]
[{"$f":"IF(B185=\"\",\"\",INDEX(信誉提升汇总记录表!B:B,SMALL(IF(信誉提升汇总记录表!$A:$A=$C$2,ROW($B:$B),36500),ROW(A182))))","v":""},{"$f":"INDEX(信誉提升汇总记录表!A:A,SMALL(IF(信誉提升汇总记录表!$A:$A=$C$2,ROW($B:$B),36500),ROW(B182)))&\"\"","v":""},{"$f":"INDEX(信誉提升汇总记录表!C:C,SMALL(IF(信誉提升汇总记录表!$A:$A=$C$2,ROW($B:$B),36500),ROW(C182)))&\"\"","v":""},{"$f":"INDEX(信誉提升汇总记录表!D:D,SMALL(IF(信誉提升汇总记录表!$A:$A=$C$2,ROW($B:$B),36500),ROW(D182)))&\"\"","v":""},{"$f":"IF(ISERROR(VALUE(INDEX(信誉提升汇总记录表!E:E,SMALL(IF(信誉提升汇总记录表!$A:$A=$C$2,ROW($B:$B),36500),ROW(E182)))&\"\")),\"\",VALUE(INDEX(信誉提升汇总记录表!E:E,SMALL(IF(信誉提升汇总记录表!$A:$A=$C$2,ROW($B:$B),36500),ROW(E182)))&\"\"))","v":""},{"$f":"INDEX(信誉提升汇总记录表!J:J,SMALL(IF(信誉提升汇总记录表!$A:$A=$C$2,ROW($B:$B),36500),ROW(F182)))&\"\"","v":""},{"$f":"INDEX(信誉提升汇总记录表!K:K,SMALL(IF(信誉提升汇总记录表!$A:$A=$C$2,ROW($B:$B),36500),ROW(G182)))&\"\"","v":""},{"$f":"INDEX(信誉提升汇总记录表!M:M,SMALL(IF(信誉提升汇总记录表!$A:$A=$C$2,ROW($B:$B),36500),ROW(H182)))&\"\"","v":""}]
[{"$f":"IF(B186=\"\",\"\",INDEX(信誉提升汇总记录表!B:B,SMALL(IF(信誉提升汇总记录表!$A:$A=$C$2,ROW($B:$B),36500),ROW(A183))))","v":""},{"$f":"INDEX(信誉提升汇总记录表!A:A,SMALL(IF(信誉提升汇总记录表!$A:$A=$C$2,ROW($B:$B),36500),ROW(B183)))&\"\"","v":""},{"$f":"INDEX(信誉提升汇总记录表!C:C,SMALL(IF(信誉提升汇总记录表!$A:$A=$C$2,ROW($B:$B),36500),ROW(C183)))&\"\"","v":""},{"$f":"INDEX(信誉提升汇总记录表!D:D,SMALL(IF(信誉提升汇总记录表!$A:$A=$C$2,ROW($B:$B),36500),ROW(D183)))&\"\"","v":""},{"$f":"IF(ISERROR(VALUE(INDEX(信誉提升汇总记录表!E:E,SMALL(IF(信誉提升汇总记录表!$A:$A=$C$2,ROW($B:$B),36500),ROW(E183)))&\"\")),\"\",VALUE(INDEX(信誉提升汇总记录表!E:E,SMALL(IF(信誉提升汇总记录表!$A:$A=$C$2,ROW($B:$B),36500),ROW(E183)))&\"\"))","v":""},{"$f":"INDEX(信誉提升汇总记录表!J:J,SMALL(IF(信誉提升汇总记录表!$A:$A=$C$2,ROW($B:$B),36500),ROW(F183)))&\"\"","v":""},{"$f":"INDEX(信誉提升汇总记录表!K:K,SMALL(IF(信誉提升汇总记录表!$A:$A=$C$2,ROW($B:$B),36500),ROW(G183)))&\"\"","v":""},{"$f":"INDEX(信誉提升汇总记录表!M:M,SMALL(IF(信誉提升汇总记录表!$A:$A=$C$2,ROW($B:$B),36500),ROW(H183)))&\"\"","v":""}]
[{"$f":"IF(B187=\"\",\"\",INDEX(信誉提升汇总记录表!B:B,SMALL(IF(信誉提升汇总记录表!$A:$A=$C$2,ROW($B:$B),36500),ROW(A184))))","v":""},{"$f":"INDEX(信誉提升汇总记录表!A:A,SMALL(IF(信誉提升汇总记录表!$A:$A=$C$2,ROW($B:$B),36500),ROW(B184)))&\"\"","v":""},{"$f":"INDEX(信誉提升汇总记录表!C:C,SMALL(IF(信誉提升汇总记录表!$A:$A=$C$2,ROW($B:$B),36500),ROW(C184)))&\"\"","v":""},{"$f":"INDEX(信誉提升汇总记录表!D:D,SMALL(IF(信誉提升汇总记录表!$A:$A=$C$2,ROW($B:$B),36500),ROW(D184)))&\"\"","v":""},{"$f":"IF(ISERROR(VALUE(INDEX(信誉提升汇总记录表!E:E,SMALL(IF(信誉提升汇总记录表!$A:$A=$C$2,ROW($B:$B),36500),ROW(E184)))&\"\")),\"\",VALUE(INDEX(信誉提升汇总记录表!E:E,SMALL(IF(信誉提升汇总记录表!$A:$A=$C$2,ROW($B:$B),36500),ROW(E184)))&\"\"))","v":""},{"$f":"INDEX(信誉提升汇总记录表!J:J,SMALL(IF(信誉提升汇总记录表!$A:$A=$C$2,ROW($B:$B),36500),ROW(F184)))&\"\"","v":""},{"$f":"INDEX(信誉提升汇总记录表!K:K,SMALL(IF(信誉提升汇总记录表!$A:$A=$C$2,ROW($B:$B),36500),ROW(G184)))&\"\"","v":""},{"$f":"INDEX(信誉提升汇总记录表!M:M,SMALL(IF(信誉提升汇总记录表!$A:$A=$C$2,ROW($B:$B),36500),ROW(H184)))&\"\"","v":""}]
[{"$f":"IF(B188=\"\",\"\",INDEX(信誉提升汇总记录表!B:B,SMALL(IF(信誉提升汇总记录表!$A:$A=$C$2,ROW($B:$B),36500),ROW(A185))))","v":""},{"$f":"INDEX(信誉提升汇总记录表!A:A,SMALL(IF(信誉提升汇总记录表!$A:$A=$C$2,ROW($B:$B),36500),ROW(B185)))&\"\"","v":""},{"$f":"INDEX(信誉提升汇总记录表!C:C,SMALL(IF(信誉提升汇总记录表!$A:$A=$C$2,ROW($B:$B),36500),ROW(C185)))&\"\"","v":""},{"$f":"INDEX(信誉提升汇总记录表!D:D,SMALL(IF(信誉提升汇总记录表!$A:$A=$C$2,ROW($B:$B),36500),ROW(D185)))&\"\"","v":""},{"$f":"IF(ISERROR(VALUE(INDEX(信誉提升汇总记录表!E:E,SMALL(IF(信誉提升汇总记录表!$A:$A=$C$2,ROW($B:$B),36500),ROW(E185)))&\"\")),\"\",VALUE(INDEX(信誉提升汇总记录表!E:E,SMALL(IF(信誉提升汇总记录表!$A:$A=$C$2,ROW($B:$B),36500),ROW(E185)))&\"\"))","v":""},{"$f":"INDEX(信誉提升汇总记录表!J:J,SMALL(IF(信誉提升汇总记录表!$A:$A=$C$2,ROW($B:$B),36500),ROW(F185)))&\"\"","v":""},{"$f":"INDEX(信誉提升汇总记录表!K:K,SMALL(IF(信誉提升汇总记录表!$A:$A=$C$2,ROW($B:$B),36500),ROW(G185)))&\"\"","v":""},{"$f":"INDEX(信誉提升汇总记录表!M:M,SMALL(IF(信誉提升汇总记录表!$A:$A=$C$2,ROW($B:$B),36500),ROW(H185)))&\"\"","v":""}]
[{"$f":"IF(B189=\"\",\"\",INDEX(信誉提升汇总记录表!B:B,SMALL(IF(信誉提升汇总记录表!$A:$A=$C$2,ROW($B:$B),36500),ROW(A186))))","v":""},{"$f":"INDEX(信誉提升汇总记录表!A:A,SMALL(IF(信誉提升汇总记录表!$A:$A=$C$2,ROW($B:$B),36500),ROW(B186)))&\"\"","v":""},{"$f":"INDEX(信誉提升汇总记录表!C:C,SMALL(IF(信誉提升汇总记录表!$A:$A=$C$2,ROW($B:$B),36500),ROW(C186)))&\"\"","v":""},{"$f":"INDEX(信誉提升汇总记录表!D:D,SMALL(IF(信誉提升汇总记录表!$A:$A=$C$2,ROW($B:$B),36500),ROW(D186)))&\"\"","v":""},{"$f":"IF(ISERROR(VALUE(INDEX(信誉提升汇总记录表!E:E,SMALL(IF(信誉提升汇总记录表!$A:$A=$C$2,ROW($B:$B),36500),ROW(E186)))&\"\")),\"\",VALUE(INDEX(信誉提升汇总记录表!E:E,SMALL(IF(信誉提升汇总记录表!$A:$A=$C$2,ROW($B:$B),36500),ROW(E186)))&\"\"))","v":""},{"$f":"INDEX(信誉提升汇总记录表!J:J,SMALL(IF(信誉提升汇总记录表!$A:$A=$C$2,ROW($B:$B),36500),ROW(F186)))&\"\"","v":""},{"$f":"INDEX(信誉提升汇总记录表!K:K,SMALL(IF(信誉提升汇总记录表!$A:$A=$C$2,ROW($B:$B),36500),ROW(G186)))&\"\"","v":""},{"$f":"INDEX(信誉提升汇总记录表!M:M,SMALL(IF(信誉提升汇总记录表!$A:$A=$C$2,ROW($B:$B),36500),ROW(H186)))&\"\"","v":""}]
[{"$f":"IF(B190=\"\",\"\",INDEX(信誉提升汇总记录表!B:B,SMALL(IF(信誉提升汇总记录表!$A:$A=$C$2,ROW($B:$B),36500),ROW(A187))))","v":""},{"$f":"INDEX(信誉提升汇总记录表!A:A,SMALL(IF(信誉提升汇总记录表!$A:$A=$C$2,ROW($B:$B),36500),ROW(B187)))&\"\"","v":""},{"$f":"INDEX(信誉提升汇总记录表!C:C,SMALL(IF(信誉提升汇总记录表!$A:$A=$C$2,ROW($B:$B),36500),ROW(C187)))&\"\"","v":""},{"$f":"INDEX(信誉提升汇总记录表!D:D,SMALL(IF(信誉提升汇总记录表!$A:$A=$C$2,ROW($B:$B),36500),ROW(D187)))&\"\"","v":""},{"$f":"IF(ISERROR(VALUE(INDEX(信誉提升汇总记录表!E:E,SMALL(IF(信誉提升汇总记录表!$A:$A=$C$2,ROW($B:$B),36500),ROW(E187)))&\"\")),\"\",VALUE(INDEX(信誉提升汇总记录表!E:E,SMALL(IF(信誉提升汇总记录表!$A:$A=$C$2,ROW($B:$B),36500),ROW(E187)))&\"\"))","v":""},{"$f":"INDEX(信誉提升汇总记录表!J:J,SMALL(IF(信誉提升汇总记录表!$A:$A=$C$2,ROW($B:$B),36500),ROW(F187)))&\"\"","v":""},{"$f":"INDEX(信誉提升汇总记录表!K:K,SMALL(IF(信誉提升汇总记录表!$A:$A=$C$2,ROW($B:$B),36500),ROW(G187)))&\"\"","v":""},{"$f":"INDEX(信誉提升汇总记录表!M:M,SMALL(IF(信誉提升汇总记录表!$A:$A=$C$2,ROW($B:$B),36500),ROW(H187)))&\"\"","v":""}]
[{"$f":"IF(B191=\"\",\"\",INDEX(信誉提升汇总记录表!B:B,SMALL(IF(信誉提升汇总记录表!$A:$A=$C$2,ROW($B:$B),36500),ROW(A188))))","v":""},{"$f":"INDEX(信誉提升汇总记录表!A:A,SMALL(IF(信誉提升汇总记录表!$A:$A=$C$2,ROW($B:$B),36500),ROW(B188)))&\"\"","v":""},{"$f":"INDEX(信誉提升汇总记录表!C:C,SMALL(IF(信誉提升汇总记录表!$A:$A=$C$2,ROW($B:$B),36500),ROW(C188)))&\"\"","v":""},{"$f":"INDEX(信誉提升汇总记录表!D:D,SMALL(IF(信誉提升汇总记录表!$A:$A=$C$2,ROW($B:$B),36500),ROW(D188)))&\"\"","v":""},{"$f":"IF(ISERROR(VALUE(INDEX(信誉提升汇总记录表!E:E,SMALL(IF(信誉提升汇总记录表!$A:$A=$C$2,ROW($B:$B),36500),ROW(E188)))&\"\")),\"\",VALUE(INDEX(信誉提升汇总记录表!E:E,SMALL(IF(信誉提升汇总记录表!$A:$A=$C$2,ROW($B:$B),36500),ROW(E188)))&\"\"))","v":""},{"$f":"INDEX(信誉提升汇总记录表!J:J,SMALL(IF(信誉提升汇总记录表!$A:$A=$C$2,ROW($B:$B),36500),ROW(F188)))&\"\"","v":""},{"$f":"INDEX(信誉提升汇总记录表!K:K,SMALL(IF(信誉提升汇总记录表!$A:$A=$C$2,ROW($B:$B),36500),ROW(G188)))&\"\"","v":""},{"$f":"INDEX(信誉提升汇总记录表!M:M,SMALL(IF(信誉提升汇总记录表!$A:$A=$C$2,ROW($B:$B),36500),ROW(H188)))&\"\"","v":""}]
[{"$f":"IF(B192=\"\",\"\",INDEX(信誉提升汇总记录表!B:B,SMALL(IF(信誉提升汇总记录表!$A:$A=$C$2,ROW($B:$B),36500),ROW(A189))))","v":""},{"$f":"INDEX(信誉提升汇总记录表!A:A,SMALL(IF(信誉提升汇总记录表!$A:$A=$C$2,ROW($B:$B),36500),ROW(B189)))&\"\"","v":""},{"$f":"INDEX(信誉提升汇总记录表!C:C,SMALL(IF(信誉提升汇总记录表!$A:$A=$C$2,ROW($B:$B),36500),ROW(C189)))&\"\"","v":""},{"$f":"INDEX(信誉提升汇总记录表!D:D,SMALL(IF(信誉提升汇总记录表!$A:$A=$C$2,ROW($B:$B),36500),ROW(D189)))&\"\"","v":""},{"$f":"IF(ISERROR(VALUE(INDEX(信誉提升汇总记录表!E:E,SMALL(IF(信誉提升汇总记录表!$A:$A=$C$2,ROW($B:$B),36500),ROW(E189)))&\"\")),\"\",VALUE(INDEX(信誉提升汇总记录表!E:E,SMALL(IF(信誉提升汇总记录表!$A:$A=$C$2,ROW($B:$B),36500),ROW(E189)))&\"\"))","v":""},{"$f":"INDEX(信誉提升汇总记录表!J:J,SMALL(IF(信誉提升汇总记录表!$A:$A=$C$2,ROW($B:$B),36500),ROW(F189)))&\"\"","v":""},{"$f":"INDEX(信誉提升汇总记录表!K:K,SMALL(IF(信誉提升汇总记录表!$A:$A=$C$2,ROW($B:$B),36500),ROW(G189)))&\"\"","v":""},{"$f":"INDEX(信誉提升汇总记录表!M:M,SMALL(IF(信誉提升汇总记录表!$A:$A=$C$2,ROW($B:$B),36500),ROW(H189)))&\"\"","v":""}]
[{"$f":"IF(B193=\"\",\"\",INDEX(信誉提升汇总记录表!B:B,SMALL(IF(信誉提升汇总记录表!$A:$A=$C$2,ROW($B:$B),36500),ROW(A190))))","v":""},{"$f":"INDEX(信誉提升汇总记录表!A:A,SMALL(IF(信誉提升汇总记录表!$A:$A=$C$2,ROW($B:$B),36500),ROW(B190)))&\"\"","v":""},{"$f":"INDEX(信誉提升汇总记录表!C:C,SMALL(IF(信誉提升汇总记录表!$A:$A=$C$2,ROW($B:$B),36500),ROW(C190)))&\"\"","v":""},{"$f":"INDEX(信誉提升汇总记录表!D:D,SMALL(IF(信誉提升汇总记录表!$A:$A=$C$2,ROW($B:$B),36500),ROW(D190)))&\"\"","v":""},{"$f":"IF(ISERROR(VALUE(INDEX(信誉提升汇总记录表!E:E,SMALL(IF(信誉提升汇总记录表!$A:$A=$C$2,ROW($B:$B),36500),ROW(E190)))&\"\")),\"\",VALUE(INDEX(信誉提升汇总记录表!E:E,SMALL(IF(信誉提升汇总记录表!$A:$A=$C$2,ROW($B:$B),36500),ROW(E190)))&\"\"))","v":""},{"$f":"INDEX(信誉提升汇总记录表!J:J,SMALL(IF(信誉提升汇总记录表!$A:$A=$C$2,ROW($B:$B),36500),ROW(F190)))&\"\"","v":""},{"$f":"INDEX(信誉提升汇总记录表!K:K,SMALL(IF(信誉提升汇总记录表!$A:$A=$C$2,ROW($B:$B),36500),ROW(G190)))&\"\"","v":""},{"$f":"INDEX(信誉提升汇总记录表!M:M,SMALL(IF(信誉提升汇总记录表!$A:$A=$C$2,ROW($B:$B),36500),ROW(H190)))&\"\"","v":""}]
[{"$f":"IF(B194=\"\",\"\",INDEX(信誉提升汇总记录表!B:B,SMALL(IF(信誉提升汇总记录表!$A:$A=$C$2,ROW($B:$B),36500),ROW(A191))))","v":""},{"$f":"INDEX(信誉提升汇总记录表!A:A,SMALL(IF(信誉提升汇总记录表!$A:$A=$C$2,ROW($B:$B),36500),ROW(B191)))&\"\"","v":""},{"$f":"INDEX(信誉提升汇总记录表!C:C,SMALL(IF(信誉提升汇总记录表!$A:$A=$C$2,ROW($B:$B),36500),ROW(C191)))&\"\"","v":""},{"$f":"INDEX(信誉提升汇总记录表!D:D,SMALL(IF(信誉提升汇总记录表!$A:$A=$C$2,ROW($B:$B),36500),ROW(D191)))&\"\"","v":""},{"$f":"IF(ISERROR(VALUE(INDEX(信誉提升汇总记录表!E:E,SMALL(IF(信誉提升汇总记录表!$A:$A=$C$2,ROW($B:$B),36500),ROW(E191)))&\"\")),\"\",VALUE(INDEX(信誉提升汇总记录表!E:E,SMALL(IF(信誉提升汇总记录表!$A:$A=$C$2,ROW($B:$B),36500),ROW(E191)))&\"\"))","v":""},{"$f":"INDEX(信誉提升汇总记录表!J:J,SMALL(IF(信誉提升汇总记录表!$A:$A=$C$2,ROW($B:$B),36500),ROW(F191)))&\"\"","v":""},{"$f":"INDEX(信誉提升汇总记录表!K:K,SMALL(IF(信誉提升汇总记录表!$A:$A=$C$2,ROW($B:$B),36500),ROW(G191)))&\"\"","v":""},{"$f":"INDEX(信誉提升汇总记录表!M:M,SMALL(IF(信誉提升汇总记录表!$A:$A=$C$2,ROW($B:$B),36500),ROW(H191)))&\"\"","v":""}]

{"sheet":"螺旋计划款操作总表","index":3,"n_rows":19,"n_cols":24,"rows_kept":19,"cut":false,"hidden":false,"merged":[[0,2,0,23],[1,2,1,9],[1,10,1,16],[1,17,1,23],[18,2,18,9],[21,3,21,20]]}
[null,null,{"$f":"螺旋计划款信誉提升明细表!C2&\"-21天信誉提升螺旋计划表\"","v":"测试货号1-拼接撞色连衣裙-21天信誉提升螺旋计划表"}]
["固定","周   期","第一周",{"$nulls":7},"第二周",{"$nulls":6},"第三周"]
["固定","上架天数","上架当天","第1天","第2天","第3天","第4天","第5天","第6天","第7天","第8天","第9天","第10天","第11天","第12天","第13天","第14天","第15天","第16天","第17天","第18天","第19天","第20天","第21天"]
["自己填","上架日期","2014-07-21","2014-07-22","2014-07-23","2014-07-24","2014-07-25","2014-07-26","2014-07-27","2014-07-28","2014-07-29","2014-07-30","2014-07-31","2014-08-01","2014-08-02","2014-08-03","2014-08-04","2014-08-05","2014-08-06","2014-08-07","2014-08-08","2014-08-09","2014-08-10","2014-08-11"]
["自己填","上架星期","星期一","星期二","星期三","星期四","星期五","星期六","星期日","星期一","星期二","星期三","星期四","星期五","星期六","星期日","星期一","星期二","星期三","星期四","星期五","星期六","星期日","星期一"]
["自己填","真实流量",null,2,5,10,35,76,130,270,20,56,112,156,230,310,523,152,270,345,467,580,790,1600]
["自己填","真实销量",null,0,0,0,1,2,5,8,1,2,4,5,8,13,19,5,9,13,16,20,32,56]
["有公式","真实转换率",null,{"$f":"IF(D6=0,0,D7/D6)","v":0},{"$f":"IF(E6=0,0,E7/E6)","v":0},{"$f":"IF(F6=0,0,F7/F6)","v":0},{"$f":"IF(G6=0,0,G7/G6)","v":0.0285714285714286},{"$f":"IF(H6=0,0,H7/H6)","v":0.0263157894736842},{"$f":"IF(I6=0,0,I7/I6)","v":0.0384615384615385},{"$f":"IF(J6=0,0,J7/J6)","v":0.0296296296296296},{"$f":"IF(K6=0,0,K7/K6)","v":0.05},{"$f":"IF(L6=0,0,L7/L6)","v":0.0357142857142857},{"$f":"IF(M6=0,0,M7/M6)","v":0.0357142857142857},{"$f":"IF(N6=0,0,N7/N6)","v":0.032051282051282},{"$f":"IF(O6=0,0,O7/O6)","v":0.0347826086956522},{"$f":"IF(P6=0,0,P7/P6)","v":0.0419354838709677},{"$f":"IF(Q6=0,0,Q7/Q6)","v":0.0363288718929254},{"$f":"IF(R6=0,0,R7/R6)","v":0.0328947368421053},{"$f":"IF(S6=0,0,S7/S6)","v":0.0333333333333333},{"$f":"IF(T6=0,0,T7/T6)","v":0.0376811594202899},{"$f":"IF(U6=0,0,U7/U6)","v":0.0342612419700214},{"$f":"IF(V6=0,0,V7/V6)","v":0.0344827586206897},{"$f":"IF(W6=0,0,W7/W6)","v":0.0405063291139241},{"$f":"IF(X6=0,0,X7/X6)","v":0.035}]
["自己填","虚假流量占比真实流量",null,8,7,7,3,2,1.5,1.2,7,4,2.5,2,1.5,1.2,1,1.8,1.6,1.5,1.3,1.2,0.98,0.95]
["有公式","需要导入的虚假流量",null,{"$f":"IF(IF(D6=0,1,D6)*D9=0,\"\",IF(D6=0,1,D6)*D9)","v":16},{"$f":"IF(IF(E6=0,1,E6)*E9=0,\"\",IF(E6=0,1,E6)*E9)","v":35},{"$f":"IF(IF(F6=0,1,F6)*F9=0,\"\",IF(F6=0,1,F6)*F9)","v":70},{"$f":"IF(IF(G6=0,1,G6)*G9=0,\"\",IF(G6=0,1,G6)*G9)","v":105},{"$f":"IF(IF(H6=0,1,H6)*H9=0,\"\",IF(H6=0,1,H6)*H9)","v":152},{"$f":"IF(IF(I6=0,1,I6)*I9=0,\"\",IF(I6=0,1,I6)*I9)","v":195},{"$f":"IF(IF(J6=0,1,J6)*J9=0,\"\",IF(J6=0,1,J6)*J9)","v":324},{"$f":"IF(IF(K6=0,1,K6)*K9=0,\"\",IF(K6=0,1,K6)*K9)","v":140},{"$f":"IF(IF(L6=0,1,L6)*L9=0,\"\",IF(L6=0,1,L6)*L9)","v":224},{"$f":"IF(IF(M6=0,1,M6)*M9=0,\"\",IF(M6=0,1,M6)*M9)","v":280},{"$f":"IF(IF(N6=0,1,N6)*N9=0,\"\",IF(N6=0,1,N6)*N9)","v":312},{"$f":"IF(IF(O6=0,1,O6)*O9=0,\"\",IF(O6=0,1,O6)*O9)","v":345},{"$f":"IF(IF(P6=0,1,P6)*P9=0,\"\",IF(P6=0,1,P6)*P9)","v":372},{"$f":"IF(IF(Q6=0,1,Q6)*Q9=0,\"\",IF(Q6=0,1,Q6)*Q9)","v":523},{"$f":"IF(IF(R6=0,1,R6)*R9=0,\"\",IF(R6=0,1,R6)*R9)","v":273.6},{"$f":"IF(IF(S6=0,1,S6)*S9=0,\"\",IF(S6=0,1,S6)*S9)","v":432},{"$f":"IF(IF(T6=0,1,T6)*T9=0,\"\",IF(T6=0,1,T6)*T9)","v":517.5},{"$f":"IF(IF(U6=0,1,U6)*U9=0,\"\",IF(U6=0,1,U6)*U9)","v":607.1},{"$f":"IF(IF(V6=0,1,V6)*V9=0,\"\",IF(V6=0,1,V6)*V9)","v":696},{"$f":"IF(IF(W6=0,1,W6)*W9=0,\"\",IF(W6=0,1,W6)*W9)","v":774.2},{"$f":"IF(IF(X6=0,1,X6)*X9=0,\"\",IF(X6=0,1,X6)*X9)","v":1520}]
["固定","需要控制的转换率",null,0.035,0.023,0.023,0.02,0.045,0.055,0.045,0.035,0.023,0.023,0.02,0.045,0.055,0.045,0.035,0.023,0.023,0.02,0.045,0.055,0.045]
["有公式","需要导入的虚假销量",null,{"$f":"IF(D11=\"\",0,D11)*IF(D10=\"\",0,D10)","v":0.56},{"$f":"IF(E11=\"\",0,E11)*IF(E10=\"\",0,E10)","v":0.805},{"$f":"IF(F11=\"\",0,F11)*IF(F10=\"\",0,F10)","v":1.61},{"$f":"IF(G11=\"\",0,G11)*IF(G10=\"\",0,G10)","v":2.1},{"$f":"IF(H11=\"\",0,H11)*IF(H10=\"\",0,H10)","v":6.84},{"$f":"IF(I11=\"\",0,I11)*IF(I10=\"\",0,I10)","v":10.725},{"$f":"IF(J11=\"\",0,J11)*IF(J10=\"\",0,J10)","v":14.58},{"$f":"IF(K11=\"\",0,K11)*IF(K10=\"\",0,K10)","v":4.9},{"$f":"IF(L11=\"\",0,L11)*IF(L10=\"\",0,L10)","v":5.152},{"$f":"IF(M11=\"\",0,M11)*IF(M10=\"\",0,M10)","v":6.44},{"$f":"IF(N11=\"\",0,N11)*IF(N10=\"\",0,N10)","v":6.24},{"$f":"IF(O11=\"\",0,O11)*IF(O10=\"\",0,O10)","v":15.525},{"$f":"IF(P11=\"\",0,P11)*IF(P10=\"\",0,P10)","v":20.46},{"$f":"IF(Q11=\"\",0,Q11)*IF(Q10=\"\",0,Q10)","v":23.535},{"$f":"IF(R11=\"\",0,R11)*IF(R10=\"\",0,R10)","v":9.576},{"$f":"IF(S11=\"\",0,S11)*IF(S10=\"\",0,S10)","v":9.936},{"$f":"IF(T11=\"\",0,T11)*IF(T10=\"\",0,T10)","v":11.9025},{"$f":"IF(U11=\"\",0,U11)*IF(U10=\"\",0,U10)","v":12.142},{"$f":"IF(V11=\"\",0,V11)*IF(V10=\"\",0,V10)","v":31.32},{"$f":"IF(W11=\"\",0,W11)*IF(W10=\"\",0,W10)","v":42.581},{"$f":"IF(X11=\"\",0,X11)*IF(X10=\"\",0,X10)","v":68.4}]
["有公式","实际完成的虚假销量",null,{"$f":"IF(SUMIF(螺旋计划款信誉提升明细表!$A$4:$A$500,D$4,螺旋计划款信誉提升明细表!$E$4:$E$500)=0,\"\",SUMIF(螺旋计划款信誉提升明细表!$A$4:$A$500,D$4,螺旋计划款信誉提升明细表!$E$4:$E$500))","v":2},{"$f":"IF(SUMIF(螺旋计划款信誉提升明细表!$A$4:$A$500,E$4,螺旋计划款信誉提升明细表!$E$4:$E$500)=0,\"\",SUMIF(螺旋计划款信誉提升明细表!$A$4:$A$500,E$4,螺旋计划款信誉提升明细表!$E$4:$E$500))","v":3},{"$f":"IF(SUMIF(螺旋计划款信誉提升明细表!$A$4:$A$500,F$4,螺旋计划款信誉提升明细表!$E$4:$E$500)=0,\"\",SUMIF(螺旋计划款信誉提升明细表!$A$4:$A$500,F$4,螺旋计划款信誉提升明细表!$E$4:$E$500))","v":2},{"$f":"IF(SUMIF(螺旋计划款信誉提升明细表!$A$4:$A$500,G$4,螺旋计划款信誉提升明细表!$E$4:$E$500)=0,\"\",SUMIF(螺旋计划款信誉提升明细表!$A$4:$A$500,G$4,螺旋计划款信誉提升明细表!$E$4:$E$500))","v":""},{"$f":"IF(SUMIF(螺旋计划款信誉提升明细表!$A$4:$A$500,H$4,螺旋计划款信誉提升明细表!$E$4:$E$500)=0,\"\",SUMIF(螺旋计划款信誉提升明细表!$A$4:$A$500,H$4,螺旋计划款信誉提升明细表!$E$4:$E$500))","v":""},{"$f":"IF(SUMIF(螺旋计划款信誉提升明细表!$A$4:$A$500,I$4,螺旋计划款信誉提升明细表!$E$4:$E$500)=0,\"\",SUMIF(螺旋计划款信誉提升明细表!$A$4:$A$500,I$4,螺旋计划款信誉提升明细表!$E$4:$E$500))","v":""},{"$f":"IF(SUMIF(螺旋计划款信誉提升明细表!$A$4:$A$500,J$4,螺旋计划款信誉提升明细表!$E$4:$E$500)=0,\"\",SUMIF(螺旋计划款信誉提升明细表!$A$4:$A$500,J$4,螺旋计划款信誉提升明细表!$E$4:$E$500))","v":""},{"$f":"IF(SUMIF(螺旋计划款信誉提升明细表!$A$4:$A$500,K$4,螺旋计划款信誉提升明细表!$E$4:$E$500)=0,\"\",SUMIF(螺旋计划款信誉提升明细表!$A$4:$A$500,K$4,螺旋计划款信誉提升明细表!$E$4:$E$500))","v":""},{"$f":"IF(SUMIF(螺旋计划款信誉提升明细表!$A$4:$A$500,L$4,螺旋计划款信誉提升明细表!$E$4:$E$500)=0,\"\",SUMIF(螺旋计划款信誉提升明细表!$A$4:$A$500,L$4,螺旋计划款信誉提升明细表!$E$4:$E$500))","v":""},{"$f":"IF(SUMIF(螺旋计划款信誉提升明细表!$A$4:$A$500,M$4,螺旋计划款信誉提升明细表!$E$4:$E$500)=0,\"\",SUMIF(螺旋计划款信誉提升明细表!$A$4:$A$500,M$4,螺旋计划款信誉提升明细表!$E$4:$E$500))","v":""},{"$f":"IF(SUMIF(螺旋计划款信誉提升明细表!$A$4:$A$500,N$4,螺旋计划款信誉提升明细表!$E$4:$E$500)=0,\"\",SUMIF(螺旋计划款信誉提升明细表!$A$4:$A$500,N$4,螺旋计划款信誉提升明细表!$E$4:$E$500))","v":""},{"$f":"IF(SUMIF(螺旋计划款信誉提升明细表!$A$4:$A$500,O$4,螺旋计划款信誉提升明细表!$E$4:$E$500)=0,\"\",SUMIF(螺旋计划款信誉提升明细表!$A$4:$A$500,O$4,螺旋计划款信誉提升明细表!$E$4:$E$500))","v":""},{"$f":"IF(SUMIF(螺旋计划款信誉提升明细表!$A$4:$A$500,P$4,螺旋计划款信誉提升明细表!$E$4:$E$500)=0,\"\",SUMIF(螺旋计划款信誉提升明细表!$A$4:$A$500,P$4,螺旋计划款信誉提升明细表!$E$4:$E$500))","v":""},{"$f":"IF(SUMIF(螺旋计划款信誉提升明细表!$A$4:$A$500,Q$4,螺旋计划款信誉提升明细表!$E$4:$E$500)=0,\"\",SUMIF(螺旋计划款信誉提升明细表!$A$4:$A$500,Q$4,螺旋计划款信誉提升明细表!$E$4:$E$500))","v":""},{"$f":"IF(SUMIF(螺旋计划款信誉提升明细表!$A$4:$A$500,R$4,螺旋计划款信誉提升明细表!$E$4:$E$500)=0,\"\",SUMIF(螺旋计划款信誉提升明细表!$A$4:$A$500,R$4,螺旋计划款信誉提升明细表!$E$4:$E$500))","v":""},{"$f":"IF(SUMIF(螺旋计划款信誉提升明细表!$A$4:$A$500,S$4,螺旋计划款信誉提升明细表!$E$4:$E$500)=0,\"\",SUMIF(螺旋计划款信誉提升明细表!$A$4:$A$500,S$4,螺旋计划款信誉提升明细表!$E$4:$E$500))","v":""},{"$f":"IF(SUMIF(螺旋计划款信誉提升明细表!$A$4:$A$500,T$4,螺旋计划款信誉提升明细表!$E$4:$E$500)=0,\"\",SUMIF(螺旋计划款信誉提升明细表!$A$4:$A$500,T$4,螺旋计划款信誉提升明细表!$E$4:$E$500))","v":""},{"$f":"IF(SUMIF(螺旋计划款信誉提升明细表!$A$4:$A$500,U$4,螺旋计划款信誉提升明细表!$E$4:$E$500)=0,\"\",SUMIF(螺旋计划款信誉提升明细表!$A$4:$A$500,U$4,螺旋计划款信誉提升明细表!$E$4:$E$500))","v":""},{"$f":"IF(SUMIF(螺旋计划款信誉提升明细表!$A$4:$A$500,V$4,螺旋计划款信誉提升明细表!$E$4:$E$500)=0,\"\",SUMIF(螺旋计划款信誉提升明细表!$A$4:$A$500,V$4,螺旋计划款信誉提升明细表!$E$4:$E$500))","v":""},{"$f":"IF(SUMIF(螺旋计划款信誉提升明细表!$A$4:$A$500,W$4,螺旋计划款信誉提升明细表!$E$4:$E$500)=0,\"\",SUMIF(螺旋计划款信誉提升明细表!$A$4:$A$500,W$4,螺旋计划款信誉提升明细表!$E$4:$E$500))","v":""},{"$f":"IF(SUMIF(螺旋计划款信誉提升明细表!$A$4:$A$500,X$4,螺旋计划款信誉提升明细表!$E$4:$E$500)=0,\"\",SUMIF(螺旋计划款信誉提升明细表!$A$4:$A$500,X$4,螺旋计划款信誉提升明细表!$E$4:$E$500))","v":""}]
["有公式","实际总流量",null,{"$f":"D6+IF(D10=\"\",0,D10)","v":18},{"$f":"E6+IF(E10=\"\",0,E10)","v":40},{"$f":"F6+IF(F10=\"\",0,F10)","v":80},{"$f":"G6+IF(G10=\"\",0,G10)","v":140},{"$f":"H6+IF(H10=\"\",0,H10)","v":228},{"$f":"I6+IF(I10=\"\",0,I10)","v":325},{"$f":"J6+IF(J10=\"\",0,J10)","v":594},{"$f":"K6+IF(K10=\"\",0,K10)","v":160},{"$f":"L6+IF(L10=\"\",0,L10)","v":280},{"$f":"M6+IF(M10=\"\",0,M10)","v":392},{"$f":"N6+IF(N10=\"\",0,N10)","v":468},{"$f":"O6+IF(O10=\"\",0,O10)","v":575},{"$f":"P6+IF(P10=\"\",0,P10)","v":682},{"$f":"Q6+IF(Q10=\"\",0,Q10)","v":1046},{"$f":"R6+IF(R10=\"\",0,R10)","v":425.6},{"$f":"S6+IF(S10=\"\",0,S10)","v":702},{"$f":"T6+IF(T10=\"\",0,T10)","v":862.5},{"$f":"U6+IF(U10=\"\",0,U10)","v":1074.1},{"$f":"V6+IF(V10=\"\",0,V10)","v":1276},{"$f":"W6+IF(W10=\"\",0,W10)","v":1564.2},{"$f":"X6+IF(X10=\"\",0,X10)","v":3120}]
["有公式","实际总销量",null,{"$f":"IF(ISERROR(VALUE(D13)),IF(D7=0,\"\",D7),D7+D13)","v":2},{"$f":"IF(ISERROR(VALUE(E13)),IF(E7=0,\"\",E7),E7+E13)","v":3},{"$f":"IF(ISERROR(VALUE(F13)),IF(F7=0,\"\",F7),F7+F13)","v":2},{"$f":"IF(ISERROR(VALUE(G13)),IF(G7=0,\"\",G7),G7+G13)","v":1},{"$f":"IF(ISERROR(VALUE(H13)),IF(H7=0,\"\",H7),H7+H13)","v":2},{"$f":"IF(ISERROR(VALUE(I13)),IF(I7=0,\"\",I7),I7+I13)","v":5},{"$f":"IF(ISERROR(VALUE(J13)),IF(J7=0,\"\",J7),J7+J13)","v":8},{"$f":"IF(ISERROR(VALUE(K13)),IF(K7=0,\"\",K7),K7+K13)","v":1},{"$f":"IF(ISERROR(VALUE(L13)),IF(L7=0,\"\",L7),L7+L13)","v":2},{"$f":"IF(ISERROR(VALUE(M13)),IF(M7=0,\"\",M7),M7+M13)","v":4},{"$f":"IF(ISERROR(VALUE(N13)),IF(N7=0,\"\",N7),N7+N13)","v":5},{"$f":"IF(ISERROR(VALUE(O13)),IF(O7=0,\"\",O7),O7+O13)","v":8},{"$f":"IF(ISERROR(VALUE(P13)),IF(P7=0,\"\",P7),P7+P13)","v":13},{"$f":"IF(ISERROR(VALUE(Q13)),IF(Q7=0,\"\",Q7),Q7+Q13)","v":19},{"$f":"IF(ISERROR(VALUE(R13)),IF(R7=0,\"\",R7),R7+R13)","v":5},{"$f":"IF(ISERROR(VALUE(S13)),IF(S7=0,\"\",S7),S7+S13)","v":9},{"$f":"IF(ISERROR(VALUE(T13)),IF(T7=0,\"\",T7),T7+T13)","v":13},{"$f":"IF(ISERROR(VALUE(U13)),IF(U7=0,\"\",U7),U7+U13)","v":16},{"$f":"IF(ISERROR(VALUE(V13)),IF(V7=0,\"\",V7),V7+V13)","v":20},{"$f":"IF(ISERROR(VALUE(W13)),IF(W7=0,\"\",W7),W7+W13)","v":32},{"$f":"IF(ISERROR(VALUE(X13)),IF(X7=0,\"\",X7),X7+X13)","v":56}]
["有公式","实际总转换率",null,{"$f":"IF(ISERROR(D15/D14),\"\",D15/D14)","v":0.111111111111111},{"$f":"IF(ISERROR(E15/E14),\"\",E15/E14)","v":0.075},{"$f":"IF(ISERROR(F15/F14),\"\",F15/F14)","v":0.025},{"$f":"IF(ISERROR(G15/G14),\"\",G15/G14)","v":0.00714285714285714},{"$f":"IF(ISERROR(H15/H14),\"\",H15/H14)","v":0.0087719298245614},{"$f":"IF(ISERROR(I15/I14),\"\",I15/I14)","v":0.0153846153846154},{"$f":"IF(ISERROR(J15/J14),\"\",J15/J14)","v":0.0134680134680135},{"$f":"IF(ISERROR(K15/K14),\"\",K15/K14)","v":0.00625},{"$f":"IF(ISERROR(L15/L14),\"\",L15/L14)","v":0.00714285714285714},{"$f":"IF(ISERROR(M15/M14),\"\",M15/M14)","v":0.0102040816326531},{"$f":"IF(ISERROR(N15/N14),\"\",N15/N14)","v":0.0106837606837607},{"$f":"IF(ISERROR(O15/O14),\"\",O15/O14)","v":0.0139130434782609},{"$f":"IF(ISERROR(P15/P14),\"\",P15/P14)","v":0.0190615835777126},{"$f":"IF(ISERROR(Q15/Q14),\"\",Q15/Q14)","v":0.0181644359464627},{"$f":"IF(ISERROR(R15/R14),\"\",R15/R14)","v":0.0117481203007519},{"$f":"IF(ISERROR(S15/S14),\"\",S15/S14)","v":0.0128205128205128},{"$f":"IF(ISERROR(T15/T14),\"\",T15/T14)","v":0.0150724637681159},{"$f":"IF(ISERROR(U15/U14),\"\",U15/U14)","v":0.0148961921608789},{"$f":"IF(ISERROR(V15/V14),\"\",V15/V14)","v":0.0156739811912226},{"$f":"IF(ISERROR(W15/W14),\"\",W15/W14)","v":0.0204577419767293},{"$f":"IF(ISERROR(X15/X14),\"\",X15/X14)","v":0.0179487179487179}]
["有公式","完 成 率",null,{"$f":"IF(ISERROR(IF(D13=\"\",0,D13/IF(0<D12<0.5,0,ROUND(D12,0)))),\"\",IF(D13=\"\",0,D13/IF(0<D12<0.5,0,ROUND(D12,0))))","v":2},{"$f":"IF(ISERROR(IF(E13=\"\",0,E13/IF(0<E12<0.5,0,ROUND(E12,0)))),\"\",IF(E13=\"\",0,E13/IF(0<E12<0.5,0,ROUND(E12,0))))","v":3},{"$f":"IF(ISERROR(IF(F13=\"\",0,F13/IF(0<F12<0.5,0,ROUND(F12,0)))),\"\",IF(F13=\"\",0,F13/IF(0<F12<0.5,0,ROUND(F12,0))))","v":1},{"$f":"IF(ISERROR(IF(G13=\"\",0,G13/IF(0<G12<0.5,0,ROUND(G12,0)))),\"\",IF(G13=\"\",0,G13/IF(0<G12<0.5,0,ROUND(G12,0))))","v":0},{"$f":"IF(ISERROR(IF(H13=\"\",0,H13/IF(0<H12<0.5,0,ROUND(H12,0)))),\"\",IF(H13=\"\",0,H13/IF(0<H12<0.5,0,ROUND(H12,0))))","v":0},{"$f":"IF(ISERROR(IF(I13=\"\",0,I13/IF(0<I12<0.5,0,ROUND(I12,0)))),\"\",IF(I13=\"\",0,I13/IF(0<I12<0.5,0,ROUND(I12,0))))","v":0},{"$f":"IF(ISERROR(IF(J13=\"\",0,J13/IF(0<J12<0.5,0,ROUND(J12,0)))),\"\",IF(J13=\"\",0,J13/IF(0<J12<0.5,0,ROUND(J12,0))))","v":0},{"$f":"IF(ISERROR(IF(K13=\"\",0,K13/IF(0<K12<0.5,0,ROUND(K12,0)))),\"\",IF(K13=\"\",0,K13/IF(0<K12<0.5,0,ROUND(K12,0))))","v":0},{"$f":"IF(ISERROR(IF(L13=\"\",0,L13/IF(0<L12<0.5,0,ROUND(L12,0)))),\"\",IF(L13=\"\",0,L13/IF(0<L12<0.5,0,ROUND(L12,0))))","v":0},{"$f":"IF(ISERROR(IF(M13=\"\",0,M13/IF(0<M12<0.5,0,ROUND(M12,0)))),\"\",IF(M13=\"\",0,M13/IF(0<M12<0.5,0,ROUND(M12,0))))","v":0},{"$f":"IF(ISERROR(IF(N13=\"\",0,N13/IF(0<N12<0.5,0,ROUND(N12,0)))),\"\",IF(N13=\"\",0,N13/IF(0<N12<0.5,0,ROUND(N12,0))))","v":0},{"$f":"IF(ISERROR(IF(O13=\"\",0,O13/IF(0<O12<0.5,0,ROUND(O12,0)))),\"\",IF(O13=\"\",0,O13/IF(0<O12<0.5,0,ROUND(O12,0))))","v":0},{"$f":"IF(ISERROR(IF(P13=\"\",0,P13/IF(0<P12<0.5,0,ROUND(P12,0)))),\"\",IF(P13=\"\",0,P13/IF(0<P12<0.5,0,ROUND(P12,0))))","v":0},{"$f":"IF(ISERROR(IF(Q13=\"\",0,Q13/IF(0<Q12<0.5,0,ROUND(Q12,0)))),\"\",IF(Q13=\"\",0,Q13/IF(0<Q12<0.5,0,ROUND(Q12,0))))","v":0},{"$f":"IF(ISERROR(IF(R13=\"\",0,R13/IF(0<R12<0.5,0,ROUND(R12,0)))),\"\",IF(R13=\"\",0,R13/IF(0<R12<0.5,0,ROUND(R12,0))))","v":0},{"$f":"IF(ISERROR(IF(S13=\"\",0,S13/IF(0<S12<0.5,0,ROUND(S12,0)))),\"\",IF(S13=\"\",0,S13/IF(0<S12<0.5,0,ROUND(S12,0))))","v":0},{"$f":"IF(ISERROR(IF(T13=\"\",0,T13/IF(0<T12<0.5,0,ROUND(T12,0)))),\"\",IF(T13=\"\",0,T13/IF(0<T12<0.5,0,ROUND(T12,0))))","v":0},{"$f":"IF(ISERROR(IF(U13=\"\",0,U13/IF(0<U12<0.5,0,ROUND(U12,0)))),\"\",IF(U13=\"\",0,U13/IF(0<U12<0.5,0,ROUND(U12,0))))","v":0},{"$f":"IF(ISERROR(IF(V13=\"\",0,V13/IF(0<V12<0.5,0,ROUND(V12,0)))),\"\",IF(V13=\"\",0,V13/IF(0<V12<0.5,0,ROUND(V12,0))))","v":0},{"$f":"IF(ISERROR(IF(W13=\"\",0,W13/IF(0<W12<0.5,0,ROUND(W12,0)))),\"\",IF(W13=\"\",0,W13/IF(0<W12<0.5,0,ROUND(W12,0))))","v":0},{"$f":"IF(ISERROR(IF(X13=\"\",0,X13/IF(0<X12<0.5,0,ROUND(X12,0)))),\"\",IF(X13=\"\",0,X13/IF(0<X12<0.5,0,ROUND(X12,0))))","v":0}]
["有公式","实际环比",null,null,{"$f":"IF(ISERROR((E15-D15)/D15),\"\",(E15-D15)/D15)","v":0.5},{"$f":"IF(ISERROR((F15-E15)/E15),\"\",(F15-E15)/E15)","v":-0.333333333333333},{"$f":"IF(ISERROR((G15-F15)/F15),\"\",(G15-F15)/F15)","v":-0.5},{"$f":"IF(ISERROR((H15-G15)/G15),\"\",(H15-G15)/G15)","v":1},{"$f":"IF(ISERROR((I15-H15)/H15),\"\",(I15-H15)/H15)","v":1.5},{"$f":"IF(ISERROR((J15-I15)/I15),\"\",(J15-I15)/I15)","v":0.6},{"$f":"IF(ISERROR((K15-J15)/J15),\"\",(K15-J15)/J15)","v":-0.875},{"$f":"IF(ISERROR((L15-K15)/K15),\"\",(L15-K15)/K15)","v":1},{"$f":"IF(ISERROR((M15-L15)/L15),\"\",(M15-L15)/L15)","v":1},{"$f":"IF(ISERROR((N15-M15)/M15),\"\",(N15-M15)/M15)","v":0.25},{"$f":"IF(ISERROR((O15-N15)/N15),\"\",(O15-N15)/N15)","v":0.6},{"$f":"IF(ISERROR((P15-O15)/O15),\"\",(P15-O15)/O15)","v":0.625},{"$f":"IF(ISERROR((Q15-P15)/P15),\"\",(Q15-P15)/P15)","v":0.461538461538462},{"$f":"IF(ISERROR((R15-Q15)/Q15),\"\",(R15-Q15)/Q15)","v":-0.736842105263158},{"$f":"IF(ISERROR((S15-R15)/R15),\"\",(S15-R15)/R15)","v":0.8},{"$f":"IF(ISERROR((T15-S15)/S15),\"\",(T15-S15)/S15)","v":0.444444444444444},{"$f":"IF(ISERROR((U15-T15)/T15),\"\",(U15-T15)/T15)","v":0.230769230769231},{"$f":"IF(ISERROR((V15-U15)/U15),\"\",(V15-U15)/U15)","v":0.25},{"$f":"IF(ISERROR((W15-V15)/V15),\"\",(W15-V15)/V15)","v":0.6},{"$f":"IF(ISERROR((X15-W15)/W15),\"\",(X15-W15)/W15)","v":0.75}]
["有公式","实际同比",{"$nulls":8},{"$f":"IF(ISERROR((K15-D15)/D15),\"\",(K15-D15)/D15)","v":-0.5},{"$f":"IF(ISERROR((L15-E15)/E15),\"\",(L15-E15)/E15)","v":-0.333333333333333},{"$f":"IF(ISERROR((M15-F15)/F15),\"\",(M15-F15)/F15)","v":1},{"$f":"IF(ISERROR((N15-G15)/G15),\"\",(N15-G15)/G15)","v":4},{"$f":"IF(ISERROR((O15-H15)/H15),\"\",(O15-H15)/H15)","v":3},{"$f":"IF(ISERROR((P15-I15)/I15),\"\",(P15-I15)/I15)","v":1.6},{"$f":"IF(ISERROR((Q15-J15)/J15),\"\",(Q15-J15)/J15)","v":1.375},{"$f":"IF(ISERROR((R15-K15)/K15),\"\",(R15-K15)/K15)","v":4},{"$f":"IF(ISERROR((S15-L15)/L15),\"\",(S15-L15)/L15)","v":3.5},{"$f":"IF(ISERROR((T15-M15)/M15),\"\",(T15-M15)/M15)","v":2.25},{"$f":"IF(ISERROR((U15-N15)/N15),\"\",(U15-N15)/N15)","v":2.2},{"$f":"IF(ISERROR((V15-O15)/O15),\"\",(V15-O15)/O15)","v":1.5},{"$f":"IF(ISERROR((W15-P15)/P15),\"\",(W15-P15)/P15)","v":1.46153846153846},{"$f":"IF(ISERROR((X15-Q15)/Q15),\"\",(X15-Q15)/Q15)","v":1.94736842105263}]

{"sheet":"螺旋计划款操作效果图表","index":4,"n_rows":50,"n_cols":12,"rows_kept":50,"cut":false,"hidden":false,"merged":[]}
{"$rows_empty":48}
[null,"2 3 2 1 2 5  8",{"$nulls":4},"1 2 3 5 8 13 19",{"$nulls":4},"5   8  13  15  20  30  55"]
[null,"4 6 4 2 4 10 16",{"$nulls":4},"2 4 6 10 13 19"]

{"sheet":"Sheet1","index":5,"n_rows":0,"n_cols":0,"rows_kept":0,"cut":false,"hidden":false,"merged":[]}