{"text_format":"2","workbook":"xlsx","n_sheets":21,"sheets":["菜单","商品信息","供应商信息","客户信息","入库单","出库单","退货单","入库表","出库表","退货表","库存表","出入库存查询","收款录入","付款录入","收付款明细查询","账户余额","日收支统计","应收汇总","应付汇总","使用说明","数据计算表勿删"],"not_rendered":{"charts":0,"images":0,"macros":1,"external_links":0,"defined_names":9,"comments":8,"pivot_tables":0},"unopened":[],"bounds":{"document_bytes":16777216,"sheet_cells":100000,"run_cost":"one","rows_first":2000,"rows_last":500,"rows_between":2000,"halvings":0,"cell_chars":16384,"cell_head_chars":4096},"cells_cut":0,"cells_raw":0,"read":"whole","date_system":"1900"}

{"sheet":"菜单","index":0,"n_rows":0,"n_cols":0,"rows_kept":0,"cut":false,"hidden":false,"merged":[[0,0,1,10],[13,0,14,10]]}

{"sheet":"商品信息","index":1,"n_rows":5,"n_cols":6,"rows_kept":5,"cut":false,"hidden":false,"merged":[[0,0,0,5]]}
["商品信息"]
["货品编码","货品名称","规格型号","单位","进货单价","销售单价"]
[5566001,"货品1","规格1","瓶",500,1000]
[5566002,"货品2","规格2","瓶",450,900]
[5566003,"货品3","规格3","瓶",600,1500]

{"sheet":"供应商信息","index":2,"n_rows":5,"n_cols":4,"rows_kept":5,"cut":false,"hidden":false,"merged":[[0,0,0,3]]}
["供应商信息"]
["序号","供应商","联系电话","地址"]
["01","供应商1",89572111,"地址1"]
["02","供应商2",89572112,"地址2"]
["03","供应商3",89572113,"地址3"]

{"sheet":"客户信息","index":3,"n_rows":5,"n_cols":4,"rows_kept":5,"cut":false,"hidden":false,"merged":[[0,0,0,3]]}
["客户信息"]
["序号","客户名称","联系电话","地址"]
["01","客户1",9553388,"广州"]
["02","客户2",9553389,"深圳"]
["03","客户3",9553390,"上海"]

{"sheet":"入库单","index":4,"n_rows":16,"n_cols":10,"rows_kept":16,"cut":false,"hidden":false,"merged":[[14,1,14,2],[14,3,14,4],[2,5,2,6],[15,1,15,2],[0,1,0,9],[1,8,1,9],[2,1,2,2],[2,8,2,9]]}
[null,"进     货     单"]
[{"$nulls":7},"No.",20180515140023]
[null,"供货单位：",null,"供应商2","电话：",89572112,null,"日   期：","2018-05-25"]
[]
[null,"序号","商品编码","商品名称","规格型号","数量","单位","单价（元）","金额（元）","备注"]
[null,1,5566003,"货品3","规格3",50,"瓶",600,30000,33]
[null,2]
[null,3]
[null,4]
[null,5]
[null,6]
[null,7]
[null,8]
[{"$nulls":7},"合计：",30000]
[null,"合计（大写）",null,{"$f":"SUBSTITUTE(SUBSTITUTE(IF(I14>-0.5%,,\"负\")&TEXT(INT(FIXED(ABS(I14))),\"[dbnum2]G/通用格式元;;\")&TEXT(RIGHT(FIXED(I14),2),\"[dbnum2]0角0分;;\"&IF(ABS(I14)>1%,\"整\",)),\"零角\",IF(ABS(I14)<1,,\"零\")),\"零分\",\"整\")","v":"叁万元整"}]
{"$rows_left_out":2}
{"sheet":"出库单","index":5,"n_rows":16,"n_cols":10,"rows_kept":16,"cut":false,"hidden":false,"merged":[[14,1,14,2],[15,1,15,2],[14,3,14,4],[0,1,0,9],[2,8,2,9],[2,5,2,6],[2,1,2,2],[1,8,1,9],[1,5,1,6]]}
[null,"发     货      单"]
[{"$nulls":4},"日  期：","2018-04-28",null,"No.",20180516140013]
[null,"客户名称：",null,"客户3","电  话：",9553390,null,"地址：","上海"]
[]
[null,"序号","商品编码","商品名称","规格型号","数量","单位","单价（元）","金额（元）","备注"]
[null,1,5566002,"货品2","规格2",33,"瓶",900,29700,33]
[null,2,5566001,"货品1","规格1",33,"瓶",1000,33000,33]
[null,3]
[null,4]
[null,5]
[null,6]
[null,7]
[null,8]
[{"$nulls":7},"合计：",62700]
[null,"合计（大写）",null,{"$f":"SUBSTITUTE(SUBSTITUTE(IF(I14>-0.5%,,\"负\")&TEXT(INT(FIXED(ABS(I14))),\"[dbnum2]G/通用格式元;;\")&TEXT(RIGHT(FIXED(I14),2),\"[dbnum2]0角0分;;\"&IF(ABS(I14)>1%,\"整\",)),\"零角\",IF(ABS(I14)<1,,\"零\")),\"零分\",\"整\")","v":"陆万贰仟柒佰元整"}]
{"$rows_left_out":2}
{"sheet":"退货单","index":6,"n_rows":16,"n_cols":10,"rows_kept":16,"cut":false,"hidden":false,"merged":[[14,1,14,2],[14,3,14,4],[15,1,15,2],[0,1,0,9],[1,5,1,6],[1,8,1,9],[2,1,2,2],[2,5,2,6],[2,8,2,9]]}
[null,"退     货      单"]
[{"$nulls":4},"日  期：","2018-04-01",null,"No.",20180516140023]
[null,"客户名称：",null,"客户2","电  话：",9553389,null,"地址：","深圳"]
[]
[null,"序号","商品编码","商品名称","规格型号","数量","单位","单价（元）","金额（元）","备注"]
[null,1,5566001,"货品1","规格1",33,"瓶",1000,33000,33]
[null,2,5566003,"货品3","规格3",33,"瓶",1500,49500,33]
[null,3]
[null,4]
[null,5]
[null,6]
[null,7]
[null,8]
[{"$nulls":7},"合计：",82500]
[null,"合计（大写）",null,{"$f":"SUBSTITUTE(SUBSTITUTE(IF(I14>-0.5%,,\"负\")&TEXT(INT(FIXED(ABS(I14))),\"[dbnum2]G/通用格式元;;\")&TEXT(RIGHT(FIXED(I14),2),\"[dbnum2]0角0分;;\"&IF(ABS(I14)>1%,\"整\",)),\"零角\",IF(ABS(I14)<1,,\"零\")),\"零分\",\"整\")","v":"捌万贰仟伍佰元整"}]
{"$rows_left_out":2}
{"sheet":"入库表","index":7,"n_rows":9,"n_cols":14,"rows_kept":9,"cut":false,"hidden":false,"merged":[[0,0,0,13]]}
["入库表"]
["进货日期","商品编码","商品名称","规格型号","数    量","单    位","单价","金    额","供应商","联系电话","送货人","发货人","单号","备注"]
["2018-04-11",5566002,"货品2","规格2",10,"瓶",450,4500,{"$nulls":4},20180515140011]
["2018-04-11",5566002,"货品2","规格2",20.55,"瓶",450,9247.5,{"$nulls":4},20180515140011]
["2018-04-27",5566003,"货品3","规格3",50,"瓶",600,19800,"供应商2",89572112,"张三","李四",20180515140023,33]
["2018-04-27",5566003,"货品3","规格3",50,"瓶",600,30000,"供应商2",89572112,"张三","李四",20180515140023,33]
["2018-04-28",5566002,"货品2","规格2",66,"瓶",450,29700,"供应商2",89572112,"张三","李四",20180515140022]
["2018-05-01",5566002,"货品2","规格2",10,"瓶",450,4500,{"$nulls":4},20180515140011]
["2018-05-01",5566002,"货品2","规格2",20.55,"瓶",450,9247.5,{"$nulls":4},20180515140011]

{"sheet":"出库表","index":8,"n_rows":14,"n_cols":15,"rows_kept":14,"cut":false,"hidden":false,"merged":[[0,0,0,14]]}
["出库表"]
["销售日期","商品编码","商品名称","规格型号","数    量","单    位","销售单价","金    额","客户","联系电话","地址","收货人","发货人","单号","备注"]
["2018-04-01",5566002,"货品2","规格2",11,"瓶",900,9900,"客户2",9553389,"深圳","张三","李四",20180516140011,11]
["2018-04-01",5566001,"货品1","规格1",11,"瓶",99.5,1094.5,"客户2",9553389,"深圳","张三","李四",20180516140011,11]
["2018-04-28",5566002,"货品2","规格2",33,"瓶",900,29700,"客户3",9553390,"上海","小明","小敏",20180516140013,33]
["2018-04-28",5566001,"货品1","规格1",33,"瓶",1000,33000,"客户3",9553390,"上海","小明","小敏",20180516140013,33]
["2018-04-28",5566002,"货品2","规格2",22,"瓶",900,19800,"客户2",9553389,"深圳","王五","赵六",20180516140012,22]
["2018-04-28",5566001,"货品1","规格1",22,"瓶",1000,22000,"客户2",9553389,"深圳","王五","赵六",20180516140012,22]
["2018-04-28",5566002,"货品2","规格2",11,"瓶",900,9900,"客户2",9553389,"深圳","张三","李四",20180516140011,11]
["2018-04-28",5566001,"货品1","规格1",11,"瓶",1000,11000,"客户2",9553389,"深圳","张三","李四",20180516140011,11]
[]
[]
[]
[{"$nulls":6},"  "]

{"sheet":"退货表","index":9,"n_rows":12,"n_cols":14,"rows_kept":12,"cut":false,"hidden":false,"merged":[[0,0,0,13]]}
["退货表"]
["退货日期","商品编码","商品名称","规格型号","数    量","单    位","销售单价","金    额","客户","联系电话","地址","收货人","单号","备注"]
["2018-04-01",5566001,"货品1","规格1",33,"瓶",1000,33000,"客户2",9553389,"深圳","王五",20180516140023,33]
["2018-04-01",5566003,"货品3","规格3",33,"瓶",1500,49500,"客户2",9553389,"深圳","王五",20180516140023,33]
["2018-04-03",5566001,"货品1","规格1",33,"瓶",1000,33000,"客户2",9553389,"深圳","王五",20180516140023,33]
["2018-04-03",5566003,"货品3","规格3",33,"瓶",1500,49500,"客户2",9553389,"深圳","王五",20180516140023,33]
["2018-04-04",5566001,"货品1","规格1",11,"瓶",1000,11000,"客户2",9553389,"深圳","张三",20180516140021,11]
["2018-04-05",5566003,"货品3","规格3",11,"瓶",1500,16500,"客户2",9553389,"深圳","张三",20180516140021,11]
[]
[]
[]
[{"$nulls":12},"  "]

{"sheet":"库存表","index":10,"n_rows":200,"n_cols":15,"rows_kept":200,"cut":false,"hidden":false,"merged":[[0,13,0,14],[0,0,0,11]]}
["库存表",{"$nulls":12},"库存预警设置"]
["货品编码","货品名称","规格型号","入库数量","进货单价","金    额","出库数量","销售单价","金    额","库存数量","利润","库存预警",null,"最大值","最小值"]
[5566001,{"$f":"IFERROR(VLOOKUP(A3,商品信息!A:F,2,0),\"-\")","v":"货品1"},{"$f":"IFERROR(VLOOKUP(A3,商品信息!A:F,3,0),\"-\")","v":"规格1"},{"$f":"SUMIF(入库表!B:B,库存表!A3,入库表!E:E)","v":0},{"$f":"IFERROR(VLOOKUP(A3,商品信息!A:F,5,0),\"-\")","v":500},{"$f":"IFERROR(D3*E3,\"-\")","v":0},{"$f":"SUMIF(出库表!B:B,库存表!A3,出库表!E:E)-SUMIF(退货表!B:B,库存表!A3,退货表!E:E)","v":0},{"$f":"IFERROR(VLOOKUP(A3,商品信息!A:F,6,0),\"-\")","v":1000},{"$f":"IFERROR(G3*H3,\"-\")","v":0},{"$f":"D3-G3","v":0},{"$f":"IFERROR(G3*(H3-E3),\"-\")","v":0},{"$f":"IF(A3<>\"\",IF(J3<$O$3,\"不足\",IF(AND(J3>$O$3,J3<$N$3),\"足\",IF(J3>$N$3,\"过量\",\"\"))),\"\")","v":"不足"},null,100,25]
[5566003,{"$f":"IFERROR(VLOOKUP(A4,商品信息!A:F,2,0),\"-\")","v":"货品3"},{"$f":"IFERROR(VLOOKUP(A4,商品信息!A:F,3,0),\"-\")","v":"规格3"},{"$f":"SUMIF(入库表!B:B,库存表!A4,入库表!E:E)","v":100},{"$f":"IFERROR(VLOOKUP(A4,商品信息!A:F,5,0),\"-\")","v":600},{"$f":"IFERROR(D4*E4,\"-\")","v":60000},{"$f":"SUMIF(出库表!B:B,库存表!A4,出库表!E:E)-SUMIF(退货表!B:B,库存表!A4,退货表!E:E)","v":-77},{"$f":"IFERROR(VLOOKUP(A4,商品信息!A:F,6,0),\"-\")","v":1500},{"$f":"IFERROR(G4*H4,\"-\")","v":-115500},{"$f":"D4-G4","v":177},{"$f":"IFERROR(G4*(H4-E4),\"-\")","v":-69300},{"$f":"IF(A4<>\"\",IF(J4<$O$3,\"不足\",IF(AND(J4>$O$3,J4<$N$3),\"足\",IF(J4>$N$3,\"过量\",\"\"))),\"\")","v":"过量"}]
[5566002,{"$f":"IFERROR(VLOOKUP(A5,商品信息!A:F,2,0),\"-\")","v":"货品2"},{"$f":"IFERROR(VLOOKUP(A5,商品信息!A:F,3,0),\"-\")","v":"规格2"},{"$f":"SUMIF(入库表!B:B,库存表!A5,入库表!E:E)","v":127.1},{"$f":"IFERROR(VLOOKUP(A5,商品信息!A:F,5,0),\"-\")","v":450},57195,{"$f":"SUMIF(出库表!B:B,库存表!A5,出库表!E:E)-SUMIF(退货表!B:B,库存表!A5,退货表!E:E)","v":77},{"$f":"IFERROR(VLOOKUP(A5,商品信息!A:F,6,0),\"-\")","v":900},69300,50.099999999999994,34650,"足"]
[null,{"$f":"IFERROR(VLOOKUP(A6,商品信息!A:F,2,0),\"-\")","v":"-"},{"$f":"IFERROR(VLOOKUP(A6,商品信息!A:F,3,0),\"-\")","v":"-"},{"$f":"SUMIF(入库表!B:B,库存表!A6,入库表!E:E)","v":0},{"$f":"IFERROR(VLOOKUP(A6,商品信息!A:F,5,0),\"-\")","v":"-"},"-",{"$f":"SUMIF(出库表!B:B,库存表!A6,出库表!E:E)-SUMIF(退货表!B:B,库存表!A6,退货表!E:E)","v":0},{"$f":"IFERROR(VLOOKUP(A6,商品信息!A:F,6,0),\"-\")","v":"-"},"-",0,"-",""]
[null,{"$f":"IFERROR(VLOOKUP(A7,商品信息!A:F,2,0),\"-\")","v":"-"},{"$f":"IFERROR(VLOOKUP(A7,商品信息!A:F,3,0),\"-\")","v":"-"},{"$f":"SUMIF(入库表!B:B,库存表!A7,入库表!E:E)","v":0},{"$f":"IFERROR(VLOOKUP(A7,商品信息!A:F,5,0),\"-\")","v":"-"},"-",{"$f":"SUMIF(出库表!B:B,库存表!A7,出库表!E:E)-SUMIF(退货表!B:B,库存表!A7,退货表!E:E)","v":0},{"$f":"IFERROR(VLOOKUP(A7,商品信息!A:F,6,0),\"-\")","v":"-"},"-",0,"-",""]
[null,{"$f":"IFERROR(VLOOKUP(A8,商品信息!A:F,2,0),\"-\")","v":"-"},{"$f":"IFERROR(VLOOKUP(A8,商品信息!A:F,3,0),\"-\")","v":"-"},{"$f":"SUMIF(入库表!B:B,库存表!A8,入库表!E:E)","v":0},{"$f":"IFERROR(VLOOKUP(A8,商品信息!A:F,5,0),\"-\")","v":"-"},"-",{"$f":"SUMIF(出库表!B:B,库存表!A8,出库表!E:E)-SUMIF(退货表!B:B,库存表!A8,退货表!E:E)","v":0},{"$f":"IFERROR(VLOOKUP(A8,商品信息!A:F,6,0),\"-\")","v":"-"},"-",0,"-",""]
[null,{"$f":"IFERROR(VLOOKUP(A9,商品信息!A:F,2,0),\"-\")","v":"-"},{"$f":"IFERROR(VLOOKUP(A9,商品信息!A:F,3,0),\"-\")","v":"-"},{"$f":"SUMIF(入库表!B:B,库存表!A9,入库表!E:E)","v":0},{"$f":"IFERROR(VLOOKUP(A9,商品信息!A:F,5,0),\"-\")","v":"-"},"-",{"$f":"SUMIF(出库表!B:B,库存表!A9,出库表!E:E)-SUMIF(退货表!B:B,库存表!A9,退货表!E:E)","v":0},{"$f":"IFERROR(VLOOKUP(A9,商品信息!A:F,6,0),\"-\")","v":"-"},"-",0,"-",""]
[null,{"$f":"IFERROR(VLOOKUP(A10,商品信息!A:F,2,0),\"-\")","v":"-"},{"$f":"IFERROR(VLOOKUP(A10,商品信息!A:F,3,0),\"-\")","v":"-"},{"$f":"SUMIF(入库表!B:B,库存表!A10,入库表!E:E)","v":0},{"$f":"IFERROR(VLOOKUP(A10,商品信息!A:F,5,0),\"-\")","v":"-"},"-",{"$f":"SUMIF(出库表!B:B,库存表!A10,出库表!E:E)-SUMIF(退货表!B:B,库存表!A10,退货表!E:E)","v":0},{"$f":"IFERROR(VLOOKUP(A10,商品信息!A:F,6,0),\"-\")","v":"-"},"-",0,"-",""]
[null,{"$f":"IFERROR(VLOOKUP(A11,商品信息!A:F,2,0),\"-\")","v":"-"},{"$f":"IFERROR(VLOOKUP(A11,商品信息!A:F,3,0),\"-\")","v":"-"},{"$f":"SUMIF(入库表!B:B,库存表!A11,入库表!E:E)","v":0},{"$f":"IFERROR(VLOOKUP(A11,商品信息!A:F,5,0),\"-\")","v":"-"},"-",{"$f":"SUMIF(出库表!B:B,库存表!A11,出库表!E:E)-SUMIF(退货表!B:B,库存表!A11,退货表!E:E)","v":0},{"$f":"IFERROR(VLOOKUP(A11,商品信息!A:F,6,0),\"-\")","v":"-"},"-",0,"-",""]
[null,{"$f":"IFERROR(VLOOKUP(A12,商品信息!A:F,2,0),\"-\")","v":"-"},{"$f":"IFERROR(VLOOKUP(A12,商品信息!A:F,3,0),\"-\")","v":"-"},{"$f":"SUMIF(入库表!B:B,库存表!A12,入库表!E:E)","v":0},{"$f":"IFERROR(VLOOKUP(A12,商品信息!A:F,5,0),\"-\")","v":"-"},"-",{"$f":"SUMIF(出库表!B:B,库存表!A12,出库表!E:E)-SUMIF(退货表!B:B,库存表!A12,退货表!E:E)","v":0},{"$f":"IFERROR(VLOOKUP(A12,商品信息!A:F,6,0),\"-\")","v":"-"},"-",0,"-",""]
[null,{"$f":"IFERROR(VLOOKUP(A13,商品信息!A:F,2,0),\"-\")","v":"-"},{"$f":"IFERROR(VLOOKUP(A13,商品信息!A:F,3,0),\"-\")","v":"-"},{"$f":"SUMIF(入库表!B:B,库存表!A13,入库表!E:E)","v":0},{"$f":"IFERROR(VLOOKUP(A13,商品信息!A:F,5,0),\"-\")","v":"-"},"-",{"$f":"SUMIF(出库表!B:B,库存表!A13,出库表!E:E)-SUMIF(退货表!B:B,库存表!A13,退货表!E:E)","v":0},{"$f":"IFERROR(VLOOKUP(A13,商品信息!A:F,6,0),\"-\")","v":"-"},"-",0,"-",""]
[null,{"$f":"IFERROR(VLOOKUP(A14,商品信息!A:F,2,0),\"-\")","v":"-"},{"$f":"IFERROR(VLOOKUP(A14,商品信息!A:F,3,0),\"-\")","v":"-"},{"$f":"SUMIF(入库表!B:B,库存表!A14,入库表!E:E)","v":0},{"$f":"IFERROR(VLOOKUP(A14,商品信息!A:F,5,0),\"-\")","v":"-"},"-",{"$f":"SUMIF(出库表!B:B,库存表!A14,出库表!E:E)-SUMIF(退货表!B:B,库存表!A14,退货表!E:E)","v":0},{"$f":"IFERROR(VLOOKUP(A14,商品信息!A:F,6,0),\"-\")","v":"-"},"-",0,"-",""]
[null,{"$f":"IFERROR(VLOOKUP(A15,商品信息!A:F,2,0),\"-\")","v":"-"},{"$f":"IFERROR(VLOOKUP(A15,商品信息!A:F,3,0),\"-\")","v":"-"},{"$f":"SUMIF(入库表!B:B,库存表!A15,入库表!E:E)","v":0},{"$f":"IFERROR(VLOOKUP(A15,商品信息!A:F,5,0),\"-\")","v":"-"},"-",{"$f":"SUMIF(出库表!B:B,库存表!A15,出库表!E:E)-SUMIF(退货表!B:B,库存表!A15,退货表!E:E)","v":0},{"$f":"IFERROR(VLOOKUP(A15,商品信息!A:F,6,0),\"-\")","v":"-"},"-",0,"-",""]
{"$rows_left_out":186}
{"sheet":"出入库存查询","index":11,"n_rows":2,"n_cols":12,"rows_kept":2,"cut":false,"hidden":false,"merged":[]}
["货品编码","货品名称","规格型号","入库数量","进货单价","金    额","出库数量","销售单价","金    额","库存数量","利润","库存预警"]
[5566002,"货品2","规格2",127.1,450,57195,77,900,69300,50.099999999999994,34650,"足"]

{"sheet":"收款录入","index":12,"n_rows":5,"n_cols":7,"rows_kept":5,"cut":false,"hidden":false,"merged":[[0,0,0,6]]}
["收款明细"]
["日期","客户","金额","收款方式","账户","收款人","备注"]
["2017-12-21","客户1",30000,"转账","建行","张三","货款"]
["2017-12-22","客户2",5000,"现金","农行","张三","货款"]
["2018-05-25"]

{"sheet":"付款录入","index":13,"n_rows":4,"n_cols":7,"rows_kept":4,"cut":false,"hidden":false,"merged":[[0,0,0,6]]}
["付款明细"]
["日期","供应商","金额","付款方式","账户","付款人","备注"]
["2018-02-08","供应商1",20000,"转账","建行","张三","货款"]
["2018-02-09","供应商2",3000,"现金","农行","张三","货款"]

{"sheet":"收付款明细查询","index":14,"n_rows":1,"n_cols":7,"rows_kept":1,"cut":false,"hidden":false,"merged":[]}
["日期","供应商","金额","付款方式","账户","付款人","备注"]

{"sheet":"账户余额","index":15,"n_rows":12,"n_cols":5,"rows_kept":12,"cut":false,"hidden":false,"merged":[[0,0,0,4]]}
["账户余额"]
["账户","期初余额","收入","支出","余额"]
["建行",100000,{"$f":"IF(A3=\"\",\"-\",SUMIF(收款录入!E:E,账户余额!A3,收款录入!C:C))","v":30000},{"$f":"IF(A3=\"\",\"-\",SUMIF(付款录入!E:E,账户余额!A3,付款录入!C:C))","v":20000},{"$f":"IFERROR(B3+C3-D3,\"-\")","v":110000}]
["农行",90000,{"$f":"IF(A4=\"\",\"-\",SUMIF(收款录入!E:E,账户余额!A4,收款录入!C:C))","v":5000},{"$f":"IF(A4=\"\",\"-\",SUMIF(付款录入!E:E,账户余额!A4,付款录入!C:C))","v":3000},{"$f":"IFERROR(B4+C4-D4,\"-\")","v":92000}]
[null,null,{"$f":"IF(A5=\"\",\"-\",SUMIF(收款录入!E:E,账户余额!A5,收款录入!C:C))","v":"-"},{"$f":"IF(A5=\"\",\"-\",SUMIF(付款录入!E:E,账户余额!A5,付款录入!C:C))","v":"-"},"-"]
[null,null,{"$f":"IF(A6=\"\",\"-\",SUMIF(收款录入!E:E,账户余额!A6,收款录入!C:C))","v":"-"},{"$f":"IF(A6=\"\",\"-\",SUMIF(付款录入!E:E,账户余额!A6,付款录入!C:C))","v":"-"},"-"]
[null,null,{"$f":"IF(A7=\"\",\"-\",SUMIF(收款录入!E:E,账户余额!A7,收款录入!C:C))","v":"-"},{"$f":"IF(A7=\"\",\"-\",SUMIF(付款录入!E:E,账户余额!A7,付款录入!C:C))","v":"-"},"-"]
[null,null,{"$f":"IF(A8=\"\",\"-\",SUMIF(收款录入!E:E,账户余额!A8,收款录入!C:C))","v":"-"},{"$f":"IF(A8=\"\",\"-\",SUMIF(付款录入!E:E,账户余额!A8,付款录入!C:C))","v":"-"},"-"]
[null,null,{"$f":"IF(A9=\"\",\"-\",SUMIF(收款录入!E:E,账户余额!A9,收款录入!C:C))","v":"-"},{"$f":"IF(A9=\"\",\"-\",SUMIF(付款录入!E:E,账户余额!A9,付款录入!C:C))","v":"-"},"-"]
[null,null,{"$f":"IF(A10=\"\",\"-\",SUMIF(收款录入!E:E,账户余额!A10,收款录入!C:C))","v":"-"},{"$f":"IF(A10=\"\",\"-\",SUMIF(付款录入!E:E,账户余额!A10,付款录入!C:C))","v":"-"},"-"]
[null,null,{"$f":"IF(A11=\"\",\"-\",SUMIF(收款录入!E:E,账户余额!A11,收款录入!C:C))","v":"-"},{"$f":"IF(A11=\"\",\"-\",SUMIF(付款录入!E:E,账户余额!A11,付款录入!C:C))","v":"-"},"-"]
[null,null,{"$f":"IF(A12=\"\",\"-\",SUMIF(收款录入!E:E,账户余额!A12,收款录入!C:C))","v":"-"},{"$f":"IF(A12=\"\",\"-\",SUMIF(付款录入!E:E,账户余额!A12,付款录入!C:C))","v":"-"},"-"]

{"sheet":"日收支统计","index":16,"n_rows":33,"n_cols":8,"rows_kept":33,"cut":false,"hidden":false,"merged":[[31,0,31,1],[32,0,32,1],[25,0,25,1],[26,0,26,1],[27,0,27,1],[28,0,28,1],[29,0,29,1],[30,0,30,1],[24,0,24,1],[13,0,13,1],[14,0,14,1],[15,0,15,1],[16,0,16,1],[17,0,17,1],[18,0,18,1],[19,0,19,1],[20,0,20,1],[21,0,21,1],[22,0,22,1],[23,0,23,1],[12,0,12,1],[0,0,0,3],[2,0,2,1],[3,0,3,1],[4,0,4,1],[5,0,5,1],[6,0,6,1],[7,0,7,1],[8,0,8,1],[9,0,9,1],[10,0,10,1],[11,0,11,1]]}
["日收支统计"]
[4,"月","收入","支出"]
[1,null,{"$f":"SUMPRODUCT((MONTH(出库表!$A$3:$A$4990)=日收支统计!$A$2)*(DAY(出库表!$A$3:$A$4990)=日收支统计!A3)*出库表!$H$3:$H$4990)","v":10994.5},{"$f":"SUMPRODUCT((MONTH(入库表!$A$3:$A$4936)=日收支统计!$A$2)*(DAY(入库表!$A$3:$A$4936)=日收支统计!A3)*入库表!$H$3:$H$4936)","v":0}]
[2,null,{"$f":"SUMPRODUCT((MONTH(出库表!$A$3:$A$4990)=日收支统计!$A$2)*(DAY(出库表!$A$3:$A$4990)=日收支统计!A4)*出库表!$H$3:$H$4990)","v":0},{"$f":"SUMPRODUCT((MONTH(入库表!$A$3:$A$4936)=日收支统计!$A$2)*(DAY(入库表!$A$3:$A$4936)=日收支统计!A4)*入库表!$H$3:$H$4936)","v":0}]
[3,null,{"$f":"SUMPRODUCT((MONTH(出库表!$A$3:$A$4990)=日收支统计!$A$2)*(DAY(出库表!$A$3:$A$4990)=日收支统计!A5)*出库表!$H$3:$H$4990)","v":0},{"$f":"SUMPRODUCT((MONTH(入库表!$A$3:$A$4936)=日收支统计!$A$2)*(DAY(入库表!$A$3:$A$4936)=日收支统计!A5)*入库表!$H$3:$H$4936)","v":0}]
[4,null,{"$f":"SUMPRODUCT((MONTH(出库表!$A$3:$A$4990)=日收支统计!$A$2)*(DAY(出库表!$A$3:$A$4990)=日收支统计!A6)*出库表!$H$3:$H$4990)","v":0},{"$f":"SUMPRODUCT((MONTH(入库表!$A$3:$A$4936)=日收支统计!$A$2)*(DAY(入库表!$A$3:$A$4936)=日收支统计!A6)*入库表!$H$3:$H$4936)","v":0}]
[5,null,{"$f":"SUMPRODUCT((MONTH(出库表!$A$3:$A$4990)=日收支统计!$A$2)*(DAY(出库表!$A$3:$A$4990)=日收支统计!A7)*出库表!$H$3:$H$4990)","v":0},{"$f":"SUMPRODUCT((MONTH(入库表!$A$3:$A$4936)=日收支统计!$A$2)*(DAY(入库表!$A$3:$A$4936)=日收支统计!A7)*入库表!$H$3:$H$4936)","v":0}]
[6,null,{"$f":"SUMPRODUCT((MONTH(出库表!$A$3:$A$4990)=日收支统计!$A$2)*(DAY(出库表!$A$3:$A$4990)=日收支统计!A8)*出库表!$H$3:$H$4990)","v":0},{"$f":"SUMPRODUCT((MONTH(入库表!$A$3:$A$4936)=日收支统计!$A$2)*(DAY(入库表!$A$3:$A$4936)=日收支统计!A8)*入库表!$H$3:$H$4936)","v":0}]
[7,null,{"$f":"SUMPRODUCT((MONTH(出库表!$A$3:$A$4990)=日收支统计!$A$2)*(DAY(出库表!$A$3:$A$4990)=日收支统计!A9)*出库表!$H$3:$H$4990)","v":0},{"$f":"SUMPRODUCT((MONTH(入库表!$A$3:$A$4936)=日收支统计!$A$2)*(DAY(入库表!$A$3:$A$4936)=日收支统计!A9)*入库表!$H$3:$H$4936)","v":0}]
[8,null,{"$f":"SUMPRODUCT((MONTH(出库表!$A$3:$A$4990)=日收支统计!$A$2)*(DAY(出库表!$A$3:$A$4990)=日收支统计!A10)*出库表!$H$3:$H$4990)","v":0},{"$f":"SUMPRODUCT((MONTH(入库表!$A$3:$A$4936)=日收支统计!$A$2)*(DAY(入库表!$A$3:$A$4936)=日收支统计!A10)*入库表!$H$3:$H$4936)","v":0}]
[9,null,{"$f":"SUMPRODUCT((MONTH(出库表!$A$3:$A$4990)=日收支统计!$A$2)*(DAY(出库表!$A$3:$A$4990)=日收支统计!A11)*出库表!$H$3:$H$4990)","v":0},{"$f":"SUMPRODUCT((MONTH(入库表!$A$3:$A$4936)=日收支统计!$A$2)*(DAY(入库表!$A$3:$A$4936)=日收支统计!A11)*入库表!$H$3:$H$4936)","v":0}]
[10,null,{"$f":"SUMPRODUCT((MONTH(出库表!$A$3:$A$4990)=日收支统计!$A$2)*(DAY(出库表!$A$3:$A$4990)=日收支统计!A12)*出库表!$H$3:$H$4990)","v":0},{"$f":"SUMPRODUCT((MONTH(入库表!$A$3:$A$4936)=日收支统计!$A$2)*(DAY(入库表!$A$3:$A$4936)=日收支统计!A12)*入库表!$H$3:$H$4936)","v":0}]
[11,null,{"$f":"SUMPRODUCT((MONTH(出库表!$A$3:$A$4990)=日收支统计!$A$2)*(DAY(出库表!$A$3:$A$4990)=日收支统计!A13)*出库表!$H$3:$H$4990)","v":0},{"$f":"SUMPRODUCT((MONTH(入库表!$A$3:$A$4936)=日收支统计!$A$2)*(DAY(入库表!$A$3:$A$4936)=日收支统计!A13)*入库表!$H$3:$H$4936)","v":13747.5}]
[12,null,{"$f":"SUMPRODUCT((MONTH(出库表!$A$3:$A$4990)=日收支统计!$A$2)*(DAY(出库表!$A$3:$A$4990)=日收支统计!A14)*出库表!$H$3:$H$4990)","v":0},{"$f":"SUMPRODUCT((MONTH(入库表!$A$3:$A$4936)=日收支统计!$A$2)*(DAY(入库表!$A$3:$A$4936)=日收支统计!A14)*入库表!$H$3:$H$4936)","v":0},null,null,null,"  "]
[13,null,{"$f":"SUMPRODUCT((MONTH(出库表!$A$3:$A$4990)=日收支统计!$A$2)*(DAY(出库表!$A$3:$A$4990)=日收支统计!A15)*出库表!$H$3:$H$4990)","v":0},{"$f":"SUMPRODUCT((MONTH(入库表!$A$3:$A$4936)=日收支统计!$A$2)*(DAY(入库表!$A$3:$A$4936)=日收支统计!A15)*入库表!$H$3:$H$4936)","v":0}]
{"$rows_left_out":19}
{"sheet":"应收汇总","index":17,"n_rows":280,"n_cols":4,"rows_kept":280,"cut":false,"hidden":false,"merged":[[0,0,0,3]]}
["应收汇总"]
["客户名称","应收金额","实收金额","欠款金额"]
["客户1",{"$f":"IF(A3=\"\",\"-\",SUMIF(出库表!I:I,应收汇总!A3,出库表!H:H))","v":0},{"$f":"IF(A3=\"\",\"-\",SUMIF(收款录入!B:B,应收汇总!A3,收款录入!C:C))","v":30000},{"$f":"IFERROR(B3-C3,\"-\")","v":-30000}]
["客户2",{"$f":"IF(A4=\"\",\"-\",SUMIF(出库表!I:I,应收汇总!A4,出库表!H:H))","v":73694.5},{"$f":"IF(A4=\"\",\"-\",SUMIF(收款录入!B:B,应收汇总!A4,收款录入!C:C))","v":5000},{"$f":"IFERROR(B4-C4,\"-\")","v":68694.5}]
[null,{"$f":"IF(A5=\"\",\"-\",SUMIF(出库表!I:I,应收汇总!A5,出库表!H:H))","v":"-"},{"$f":"IF(A5=\"\",\"-\",SUMIF(收款录入!B:B,应收汇总!A5,收款录入!C:C))","v":"-"},"-"]
[null,{"$f":"IF(A6=\"\",\"-\",SUMIF(出库表!I:I,应收汇总!A6,出库表!H:H))","v":"-"},{"$f":"IF(A6=\"\",\"-\",SUMIF(收款录入!B:B,应收汇总!A6,收款录入!C:C))","v":"-"},"-"]
[null,{"$f":"IF(A7=\"\",\"-\",SUMIF(出库表!I:I,应收汇总!A7,出库表!H:H))","v":"-"},{"$f":"IF(A7=\"\",\"-\",SUMIF(收款录入!B:B,应收汇总!A7,收款录入!C:C))","v":"-"},"-"]
[null,{"$f":"IF(A8=\"\",\"-\",SUMIF(出库表!I:I,应收汇总!A8,出库表!H:H))","v":"-"},{"$f":"IF(A8=\"\",\"-\",SUMIF(收款录入!B:B,应收汇总!A8,收款录入!C:C))","v":"-"},"-"]
[null,{"$f":"IF(A9=\"\",\"-\",SUMIF(出库表!I:I,应收汇总!A9,出库表!H:H))","v":"-"},{"$f":"IF(A9=\"\",\"-\",SUMIF(收款录入!B:B,应收汇总!A9,收款录入!C:C))","v":"-"},"-"]
[null,{"$f":"IF(A10=\"\",\"-\",SUMIF(出库表!I:I,应收汇总!A10,出库表!H:H))","v":"-"},{"$f":"IF(A10=\"\",\"-\",SUMIF(收款录入!B:B,应收汇总!A10,收款录入!C:C))","v":"-"},"-"]
[null,{"$f":"IF(A11=\"\",\"-\",SUMIF(出库表!I:I,应收汇总!A11,出库表!H:H))","v":"-"},{"$f":"IF(A11=\"\",\"-\",SUMIF(收款录入!B:B,应收汇总!A11,收款录入!C:C))","v":"-"},"-"]
[null,{"$f":"IF(A12=\"\",\"-\",SUMIF(出库表!I:I,应收汇总!A12,出库表!H:H))","v":"-"},{"$f":"IF(A12=\"\",\"-\",SUMIF(收款录入!B:B,应收汇总!A12,收款录入!C:C))","v":"-"},"-"]
[null,{"$f":"IF(A13=\"\",\"-\",SUMIF(出库表!I:I,应收汇总!A13,出库表!H:H))","v":"-"},{"$f":"IF(A13=\"\",\"-\",SUMIF(收款录入!B:B,应收汇总!A13,收款录入!C:C))","v":"-"},"-"]
[null,{"$f":"IF(A14=\"\",\"-\",SUMIF(出库表!I:I,应收汇总!A14,出库表!H:H))","v":"-"},{"$f":"IF(A14=\"\",\"-\",SUMIF(收款录入!B:B,应收汇总!A14,收款录入!C:C))","v":"-"},"-"]
[null,{"$f":"IF(A15=\"\",\"-\",SUMIF(出库表!I:I,应收汇总!A15,出库表!H:H))","v":"-"},{"$f":"IF(A15=\"\",\"-\",SUMIF(收款录入!B:B,应收汇总!A15,收款录入!C:C))","v":"-"},"-"]
{"$rows_left_out":266}
{"sheet":"应付汇总","index":18,"n_rows":445,"n_cols":4,"rows_kept":445,"cut":false,"hidden":false,"merged":[[0,0,0,3]]}
["应付汇总"]
["供货单位","应付金额","实付金额","欠款金额"]
["供应商1",{"$f":"IF(A3=\"\",\"-\",SUMIF(入库表!I:I,应付汇总!A3,入库表!H:H))","v":0},{"$f":"IF(A3=\"\",\"-\",SUMIF(付款录入!B:B,应付汇总!A3,付款录入!C:C))","v":20000},{"$f":"IFERROR(B3-C3,\"-\")","v":-20000}]
["供应商2",{"$f":"IF(A4=\"\",\"-\",SUMIF(入库表!I:I,应付汇总!A4,入库表!H:H))","v":79500},{"$f":"IF(A4=\"\",\"-\",SUMIF(付款录入!B:B,应付汇总!A4,付款录入!C:C))","v":3000},{"$f":"IFERROR(B4-C4,\"-\")","v":76500}]
[null,{"$f":"IF(A5=\"\",\"-\",SUMIF(入库表!I:I,应付汇总!A5,入库表!H:H))","v":"-"},{"$f":"IF(A5=\"\",\"-\",SUMIF(付款录入!B:B,应付汇总!A5,付款录入!C:C))","v":"-"},"-"]
[null,{"$f":"IF(A6=\"\",\"-\",SUMIF(入库表!I:I,应付汇总!A6,入库表!H:H))","v":"-"},{"$f":"IF(A6=\"\",\"-\",SUMIF(付款录入!B:B,应付汇总!A6,付款录入!C:C))","v":"-"},"-"]
[null,{"$f":"IF(A7=\"\",\"-\",SUMIF(入库表!I:I,应付汇总!A7,入库表!H:H))","v":"-"},{"$f":"IF(A7=\"\",\"-\",SUMIF(付款录入!B:B,应付汇总!A7,付款录入!C:C))","v":"-"},"-"]
[null,{"$f":"IF(A8=\"\",\"-\",SUMIF(入库表!I:I,应付汇总!A8,入库表!H:H))","v":"-"},{"$f":"IF(A8=\"\",\"-\",SUMIF(付款录入!B:B,应付汇总!A8,付款录入!C:C))","v":"-"},"-"]
[null,{"$f":"IF(A9=\"\",\"-\",SUMIF(入库表!I:I,应付汇总!A9,入库表!H:H))","v":"-"},{"$f":"IF(A9=\"\",\"-\",SUMIF(付款录入!B:B,应付汇总!A9,付款录入!C:C))","v":"-"},"-"]
[null,{"$f":"IF(A10=\"\",\"-\",SUMIF(入库表!I:I,应付汇总!A10,入库表!H:H))","v":"-"},{"$f":"IF(A10=\"\",\"-\",SUMIF(付款录入!B:B,应付汇总!A10,付款录入!C:C))","v":"-"},"-"]
[null,{"$f":"IF(A11=\"\",\"-\",SUMIF(入库表!I:I,应付汇总!A11,入库表!H:H))","v":"-"},{"$f":"IF(A11=\"\",\"-\",SUMIF(付款录入!B:B,应付汇总!A11,付款录入!C:C))","v":"-"},"-"]
[null,{"$f":"IF(A12=\"\",\"-\",SUMIF(入库表!I:I,应付汇总!A12,入库表!H:H))","v":"-"},{"$f":"IF(A12=\"\",\"-\",SUMIF(付款录入!B:B,应付汇总!A12,付款录入!C:C))","v":"-"},"-"]
[null,{"$f":"IF(A13=\"\",\"-\",SUMIF(入库表!I:I,应付汇总!A13,入库表!H:H))","v":"-"},{"$f":"IF(A13=\"\",\"-\",SUMIF(付款录入!B:B,应付汇总!A13,付款录入!C:C))","v":"-"},"-"]
[null,{"$f":"IF(A14=\"\",\"-\",SUMIF(入库表!I:I,应付汇总!A14,入库表!H:H))","v":"-"},{"$f":"IF(A14=\"\",\"-\",SUMIF(付款录入!B:B,应付汇总!A14,付款录入!C:C))","v":"-"},"-"]
[null,{"$f":"IF(A15=\"\",\"-\",SUMIF(入库表!I:I,应付汇总!A15,入库表!H:H))","v":"-"},{"$f":"IF(A15=\"\",\"-\",SUMIF(付款录入!B:B,应付汇总!A15,付款录入!C:C))","v":"-"},"-"]
{"$rows_left_out":431}
{"sheet":"使用说明","index":19,"n_rows":2,"n_cols":2,"rows_kept":2,"cut":false,"hidden":false,"merged":[[1,1,2,1]]}
[null,"使用说明"]
[null,"1.本表由VBA编码制作而成，用户使用本模板时需启动宏，工作表中带有公式的单元格不要去更改，本工作簿需要用户将基础信息录入进来，方便入库单和出库单的信息录入。\n2.点击系统初始化即可清空系统数据，点击文件备份按钮即可自动备份。\n3.入库单，出库单，退货单中供应商和客户的信息都可以双击单元格弹出窗体，选中窗体信息双击即可完成录入，如果入库单和出库单的行数不够或者过多可以点击增加和减少行数按钮,单据的，打印区域会自动设置直接点击按钮即可打印，录入之后点击保存按钮入库单和出库单的信息会自动保存到入库和出库报表中；退货单中的数量和金额会保存到退货表中，退货数量会自动计入库存，这样确保库存的实时数量。入库单，出库单，退货单的删除单据，修改单据，查询单据功能，直接单击按钮，会弹出窗体输入单据单号即可，单据单号可以下拉选择，录入框带模糊查找功能可以输入关键数字自动查找。\n4.库存表中只需用户录入产品编码(双击产品编码单元格可弹出窗体进行辅助输入)，其他的信息自动录入，所有产品的库存量实时自动更新。\n5.库存查询工作表中需要用户进行选择入库、出库或者库存，选完后系统会根据用户填写的日期和商品编码进行查询（可以单独按时间或产品编码查询也可以综合查询）。\n6.收款录入表和付款录入（双击供应商和客户单元格可弹出窗体辅助输入）表需手动录入，收付款明细查询中输入条件即可。\n7.应收应付汇总表中只需填写客户名称和供应商（双击单元格可弹出窗体辅助输入），金额自动统计。\n8.账户余额表中只需填写账户名称，需和收付款录入表中一致，只需填写账户名和期初余额，收入支出余额自动显示。\n9.日收支统计表只需更改月份，其他的自动显示，公式已保护如需撤销-审阅-撤销保护。\n10.WPS用户先启用宏，下载安装宏插件，宏插件下载地址：https://pan.baidu.com/s/1kVORBlt \n\n\n"]

{"sheet":"数据计算表勿删","index":20,"n_rows":3,"n_cols":15,"rows_kept":3,"cut":false,"hidden":true,"merged":[]}
["销售日期","商品编码","商品名称","规格型号","数    量","单    位","销售单价","金    额","客户","联系电话","地址","收货人","发货人","单号","备注"]
["2018-04-28",5566002,"货品2","规格2",33,"瓶",900,29700,"客户3",9553390,"上海","小明","小敏",20180516140013,33]
["2018-04-28",5566001,"货品1","规格1",33,"瓶",1000,33000,"客户3",9553390,"上海","小明","小敏",20180516140013,33]